program: Orca
programVersion: 5.0.2
elementType: F F F F F F O O N N N N C C C C C C C C C C C C C C C C C C C C C C C C H H H H H H H H H H H H H H H H
charge: 0
multiplicity: 1
keywords: wb97x-d3
keywords: def2-TZVPP
keywords: def2/J RIJCOSX
keywords: DEFGRID2
keywords: scfconv7
keywords: smallprint printgap noloewdin
keywords: NOSOSCF
formula: C24H16F6N4O2
InChI: InChI=1/C24H16F6N4O2/c25-23(26,27)18-3-1-2-17(13-18)21(12-15-4-6-16(14-31)7-5-15)33-34-22(35)32-19-8-10-20(11-9-19)36-24(28,29)30/h1-11,13,32,34H,12H2
52 atoms
F  -3.632692 -6.682595 -0.42792
F  -4.605841 -5.353465 0.956664
F  -2.777507 -6.337959 1.512667
F  6.737472 3.929938 -1.082617
F  6.818802 1.995014 -2.000272
F  8.504902 2.718316 -0.872082
O  6.751086 2.128144 0.222251
O  0.371397 2.724808 1.816707
N  -0.94641 -0.296015 0.771432
N  -0.8795 0.929956 1.295099
N  1.35472 0.920108 0.792249
N  -5.387431 5.139052 -2.281589
C  -3.359449 -0.410008 1.233203
C  -2.043843 -0.944261 0.725697
C  -1.961881 -2.274093 0.086272
C  -3.821591 0.802935 0.458591
C  -2.738038 -3.338168 0.536338
C  -2.619601 -4.59121 -0.052462
C  -1.077782 -2.486667 -0.973193
C  -4.311108 1.920721 1.129073
C  -3.766719 0.821194 -0.934273
C  -1.735388 -4.795559 -1.103078
C  -0.970322 -3.733753 -1.561531
C  -3.411321 -5.73874 0.492398
C  -4.727307 3.042245 0.433057
C  -4.176808 1.934313 -1.643034
C  -4.654467 3.051612 -0.957902
C  2.687614 1.301967 0.67624
C  0.318359 1.607893 1.332203
C  3.565512 0.339577 0.168496
C  3.192072 2.555662 1.023717
C  5.387709 1.868246 0.341792
C  4.907689 0.6168 -0.001921
C  4.541386 2.831668 0.854696
C  -5.061099 4.208157 -1.686655
C  7.182125 2.682256 -0.916468
H  -4.128254 -1.180392 1.164994
H  -3.279811 -0.158607 2.295423
H  -3.420196 -3.193111 1.364317
H  -0.4835 -1.664314 -1.349056
H  -4.359197 1.92105 2.211169
H  -3.394913 -0.038143 -1.478608
H  -1.636998 -5.764115 -1.574484
H  -0.290401 -3.881974 -2.389723
H  -5.098487 3.90754 0.965777
H  -4.123667 1.940995 -2.723469
H  -1.673696 1.403852 1.710588
H  1.129503 -0.007799 0.456081
H  3.192683 -0.642331 -0.098307
H  2.552845 3.325835 1.422298
H  5.57271 -0.146323 -0.384891
H  4.92206 3.803224 1.14184
elementType: F O N C H
totalener: -1892.96861537 hartree
nucrepener: 3558.77242921 hartree
electener: -5451.74104457 hartree
oneelecener: -9670.39749702 hartree
twoeener: 4218.65645244 hartree
cpcmener: -0.04681260 hartree
kineticenergy: 1885.77805058 hartree
xcener: -170.264495046414 hartree
chargesum: -0.0000000
charge: -0.181394 -0.182945 -0.182118 -0.176007 -0.174966 -0.167083 -0.310061 -0.524773 -0.227572 -0.037753 -0.163777 -0.111991 -0.047537 0.165972 0.004660 -0.059567 -0.164816 -0.067449 -0.188769 -0.142715 -0.130370 -0.116278 -0.150142 0.542643 -0.177106 -0.181098 0.188712 0.208648 0.423126 -0.223149 -0.233299 0.170303 -0.129091 -0.131666 -0.118854 0.587869 0.111347 0.128383 0.141337 0.143231 0.149723 0.151025 0.150798 0.159446 0.156828 0.155853 0.174387 0.184595 0.140147 0.157226 0.153677 0.152407
qa: -0.1814 -0.1829 -0.1821 -0.1760 -0.1750 -0.1671 -0.3101 -0.5248 -0.2276 -0.0378 -0.1638 -0.1120 -0.0475 0.1660 0.0047 -0.0596 -0.1648 -0.0674 -0.1888 -0.1427 -0.1304 -0.1163 -0.1501 0.5426 -0.1771 -0.1811 0.1887 0.2086 0.4231 -0.2231 -0.2333 0.1703 -0.1291 -0.1317 -0.1189 0.5879 0.1113 0.1284 0.1413 0.1432 0.1497 0.1510 0.1508 0.1594 0.1568 0.1559 0.1744 0.1846 0.1401 0.1572 0.1537 0.1524
va: 1.1199 1.1171 1.1059 1.1235 1.1237 1.1377 2.0823 1.9886 3.0055 3.1686 3.2183 3.1266 3.7777 3.7900 3.7052 3.6979 4.0236 3.7506 3.9797 3.9273 3.9048 3.9544 3.9522 4.4400 4.0136 4.0173 3.6089 3.8055 4.3311 3.9632 3.9738 3.7590 4.0165 4.0394 4.0121 4.6193 1.0093 1.0073 1.0228 1.0156 1.0006 0.9962 1.0059 0.9923 1.0028 1.0042 1.0342 1.0230 1.0061 1.0331 0.9986 1.0022
dispcorr: -0.025039976 hartree
energy: -1892.993655345090
dipole: -23.83925 22.77895 -1.06029 8.74607 -11.91971 -3.17364 4.31420 -3.67873 0.63547
magnitude: 3.40589 au
magnitude: 8.65708 debye
