program: Orca
programVersion: 5.0.2
elementType: F F F F F F O O N N N N C C C C C C C C C C C C C C C C C C C C C C C C H H H H H H H H H H H H H H H H
charge: 0
multiplicity: 1
keywords: wb97x-d3
keywords: def2-TZVPP
keywords: def2/J RIJCOSX
keywords: DEFGRID2
keywords: scfconv7
keywords: smallprint printgap noloewdin
keywords: NOSOSCF
formula: C24H16F6N4O2
InChI: InChI=1/C24H16F6N4O2/c25-23(26,27)18-3-1-2-17(13-18)21(12-15-4-6-16(14-31)7-5-15)33-34-22(35)32-19-8-10-20(11-9-19)36-24(28,29)30/h1-11,13,32,34H,12H2
52 atoms
F  -1.340387 -4.687389 -1.851242
F  0.151853 -3.1891 -1.458656
F  -1.355243 -2.837657 -2.946749
F  7.287431 -1.021887 1.107061
F  7.762993 0.988742 1.672486
F  8.927346 0.002713 0.153439
O  6.930463 0.616889 -0.356829
O  1.232888 3.46919 1.417126
N  -1.030328 0.90608 0.938755
N  -0.553283 2.110012 1.25168
N  1.508496 1.323285 0.644338
N  -8.956665 1.421224 -2.42629
C  -3.369086 1.450685 1.56921
C  -2.256474 0.57865 1.050068
C  -2.56781 -0.807568 0.634601
C  -4.592383 1.442929 0.689675
C  -1.772688 -1.440005 -0.317942
C  -2.027791 -2.750083 -0.694534
C  -3.634907 -1.512124 1.190716
C  -4.476885 1.558819 -0.693952
C  -5.860353 1.338742 1.254516
C  -3.092266 -3.447013 -0.136889
C  -3.890333 -2.818565 0.806416
C  -1.147532 -3.371839 -1.734325
C  -5.599777 1.55555 -1.500438
C  -6.994268 1.338503 0.46212
C  -6.863321 1.441716 -0.921224
C  2.877581 1.228304 0.418159
C  0.792392 2.372496 1.119377
C  3.336365 0.007096 -0.085077
C  3.79991 2.248009 0.655083
C  5.58033 0.813299 -0.07344
C  4.679137 -0.205073 -0.329262
C  5.148252 2.033567 0.408467
C  -8.023095 1.42499 -1.750683
C  7.702582 0.154565 0.632948
H  -3.639117 1.12095 2.576606
H  -3.042374 2.487207 1.680992
H  -0.955552 -0.890371 -0.767667
H  -4.26454 -1.056472 1.943521
H  -3.500096 1.646654 -1.154179
H  -5.964251 1.247604 2.328662
H  -3.310696 -4.466513 -0.423812
H  -4.717983 -3.35564 1.24985
H  -5.500154 1.638552 -2.574451
H  -7.974314 1.251546 0.911949
H  -1.12847 2.861496 1.614868
H  0.970371 0.488667 0.4479
H  2.631993 -0.791396 -0.286799
H  3.489694 3.208141 1.032762
H  5.01235 -1.154619 -0.727122
H  5.852518 2.835696 0.587012
elementType: F O N C H
totalener: -1892.96838221 hartree
nucrepener: 3607.61786043 hartree
electener: -5500.58624264 hartree
oneelecener: -9768.26596010 hartree
twoeener: 4267.67971746 hartree
cpcmener: -0.04827593 hartree
kineticenergy: 1885.78278816 hartree
xcener: -170.267794828693 hartree
chargesum: -0.0000000
charge: -0.179906 -0.183456 -0.182889 -0.175243 -0.175302 -0.166726 -0.310014 -0.525153 -0.226903 -0.035127 -0.163644 -0.115073 -0.047466 0.183242 -0.024613 -0.012143 -0.168406 -0.061833 -0.185522 -0.151365 -0.148825 -0.117766 -0.148950 0.549240 -0.171587 -0.175579 0.179528 0.210913 0.424285 -0.223958 -0.234623 0.170235 -0.130599 -0.130654 -0.112093 0.587931 0.119457 0.109068 0.129189 0.152218 0.150278 0.145998 0.152535 0.159099 0.156595 0.156589 0.161159 0.188631 0.139051 0.155160 0.152730 0.152283
qa: -0.1799 -0.1835 -0.1829 -0.1752 -0.1753 -0.1667 -0.3100 -0.5252 -0.2269 -0.0351 -0.1636 -0.1151 -0.0475 0.1832 -0.0246 -0.0121 -0.1684 -0.0618 -0.1855 -0.1514 -0.1488 -0.1178 -0.1489 0.5492 -0.1716 -0.1756 0.1795 0.2109 0.4243 -0.2240 -0.2346 0.1702 -0.1306 -0.1307 -0.1121 0.5879 0.1195 0.1091 0.1292 0.1522 0.1503 0.1460 0.1525 0.1591 0.1566 0.1566 0.1612 0.1886 0.1391 0.1552 0.1527 0.1523
va: 1.1236 1.1114 1.1087 1.1238 1.1238 1.1385 2.0825 1.9891 2.9900 3.1666 3.2157 3.1241 3.8257 3.7354 3.7361 3.6907 4.0545 3.7736 3.9624 3.9056 3.9309 3.9341 3.9580 4.4314 3.9935 4.0074 3.6116 3.8058 4.3385 3.9608 3.9735 3.7600 4.0227 4.0317 4.0069 4.6189 1.0058 1.0085 1.0390 1.0006 0.9987 1.0014 1.0050 0.9932 1.0034 1.0029 1.0401 1.0183 1.0109 1.0344 0.9996 1.0018
dispcorr: -0.025456606 hartree
energy: -1892.993838815138
dipole: -44.17525 42.29420 -1.88105 16.59267 -17.17073 -0.57806 11.01717 -8.78515 2.23202
magnitude: 2.97563 au
magnitude: 7.56346 debye
