program: Orca
programVersion: 5.0.2
elementType: F F F F F F O O N N N N C C C C C C C C C C C C C C C C C C C C C C C C H H H H H H H H H H H H H H H H
charge: 0
multiplicity: 1
keywords: wb97x-d3
keywords: def2-TZVPP
keywords: def2/J RIJCOSX
keywords: DEFGRID2
keywords: scfconv7
keywords: smallprint printgap noloewdin
keywords: NOSOSCF
formula: C24H16F6N4O2
InChI: InChI=1/C24H16F6N4O2/c25-23(26,27)18-3-1-2-17(13-18)21(12-15-4-6-16(14-31)7-5-15)33-34-22(35)32-19-8-10-20(11-9-19)36-24(28,29)30/h1-11,13,32,34H,12H2
52 atoms
F  -5.194577 -3.37299 -0.086798
F  -3.611507 -4.301167 1.028417
F  -4.015677 -4.933154 -0.985501
F  9.592129 1.072084 -0.111297
F  8.068984 -0.426431 0.156699
F  8.222567 1.194052 1.549344
O  7.557526 1.629314 -0.53013
O  1.628002 3.330764 1.829772
N  -0.432994 0.905655 0.473462
N  -0.04443 1.976153 1.173013
N  2.072371 1.605117 0.380981
N  -8.932923 -0.076693 -1.481204
C  -2.760601 1.118786 1.273719
C  -1.636081 0.485813 0.484904
C  -1.890547 -0.71214 -0.345332
C  -4.126885 0.899638 0.684575
C  -2.74254 -1.717329 0.098332
C  -2.99397 -2.827732 -0.698321
C  -1.280443 -0.847905 -1.592317
C  -5.1417 0.322715 1.441308
C  -4.391457 1.263943 -0.634531
C  -2.394566 -2.950874 -1.943593
C  -1.529196 -1.958096 -2.37976
C  -3.949358 -3.862182 -0.191707
C  -6.388218 0.081007 0.891752
C  -5.630658 1.030366 -1.198558
C  -6.631118 0.426951 -0.435607
C  3.449674 1.679688 0.198658
C  1.27499 2.370367 1.167492
C  4.020038 0.694945 -0.614007
C  4.278665 2.653961 0.756605
C  6.188069 1.625293 -0.270579
C  5.380536 0.663501 -0.8517
C  5.6456 2.617568 0.521784
C  -7.904731 0.155391 -1.01638
C  8.335141 0.878857 0.257544
H  -2.733159 0.75178 2.304159
H  -2.595708 2.199133 1.335676
H  -3.201311 -1.642309 1.076005
H  -0.622344 -0.068752 -1.954631
H  -4.951591 0.039383 2.469084
H  -3.616173 1.724056 -1.235414
H  -2.58951 -3.802503 -2.580531
H  -1.056692 -2.047779 -3.34882
H  -7.165749 -0.381184 1.48517
H  -5.823616 1.30597 -2.226751
H  -0.664712 2.496177 1.783105
H  1.606589 0.838348 -0.088009
H  3.389856 -0.062675 -1.065367
H  3.880214 3.441143 1.375348
H  5.796807 -0.100749 -1.494787
H  6.279237 3.381353 0.954204
elementType: F O N C H
totalener: -1892.96733240 hartree
nucrepener: 3589.08119321 hartree
electener: -5482.04852561 hartree
oneelecener: -9731.24035372 hartree
twoeener: 4249.19182811 hartree
cpcmener: -0.04818019 hartree
kineticenergy: 1885.77544876 hartree
xcener: -170.264949859622 hartree
chargesum: -0.0000000
charge: -0.180399 -0.184117 -0.179732 -0.166733 -0.176995 -0.174911 -0.309197 -0.525006 -0.246383 -0.038418 -0.161083 -0.112579 -0.074383 0.200785 0.023610 0.005088 -0.203586 -0.067907 -0.187603 -0.149488 -0.165965 -0.112646 -0.148755 0.547292 -0.184702 -0.167763 0.182335 0.208040 0.423618 -0.224981 -0.233470 0.169620 -0.124863 -0.134053 -0.117110 0.587992 0.126500 0.118724 0.151983 0.140762 0.146047 0.148646 0.152730 0.159156 0.154966 0.155943 0.163080 0.181852 0.140329 0.157512 0.153084 0.153136
qa: -0.1804 -0.1841 -0.1797 -0.1667 -0.1770 -0.1749 -0.3092 -0.5250 -0.2464 -0.0384 -0.1611 -0.1126 -0.0744 0.2008 0.0236 0.0051 -0.2036 -0.0679 -0.1876 -0.1495 -0.1660 -0.1126 -0.1488 0.5473 -0.1847 -0.1678 0.1823 0.2080 0.4236 -0.2250 -0.2335 0.1696 -0.1249 -0.1341 -0.1171 0.5880 0.1265 0.1187 0.1520 0.1408 0.1460 0.1486 0.1527 0.1592 0.1550 0.1559 0.1631 0.1819 0.1403 0.1575 0.1531 0.1531
va: 1.1098 1.1136 1.1240 1.1386 1.1218 1.1243 2.0838 1.9883 2.9905 3.1672 3.2131 3.1275 3.7995 3.7256 3.6321 3.6578 4.0180 3.7596 3.9885 3.9109 3.9238 3.9238 3.9539 4.4363 3.9892 3.9865 3.6164 3.8083 4.3384 3.9669 3.9696 3.7601 4.0186 4.0333 4.0117 4.6182 1.0013 1.0026 1.0185 1.0167 1.0022 0.9981 1.0044 0.9922 1.0036 1.0032 1.0375 1.0260 1.0062 1.0330 1.0003 1.0003
dispcorr: -0.026182434 hartree
energy: -1892.993514833897
dipole: -25.28125 25.32385 0.04260 17.76183 -17.62925 0.13258 -2.62434 2.58858 -0.03577
magnitude: 0.14378 au
magnitude: 0.36545 debye
