program: Orca
programVersion: 5.0.2
elementType: F F F F F F O O N N N N C C C C C C C C C C C C C C C C C C C C C C C C H H H H H H H H H H H H H H H H
charge: 0
multiplicity: 1
keywords: wb97x-d3
keywords: def2-TZVPP
keywords: def2/J RIJCOSX
keywords: DEFGRID2
keywords: scfconv7
keywords: smallprint printgap noloewdin
keywords: NOSOSCF
formula: C24H16F6N4O2
InChI: InChI=1/C24H16F6N4O2/c25-23(26,27)18-3-1-2-17(13-18)21(12-15-4-6-16(14-31)7-5-15)33-34-22(35)32-19-8-10-20(11-9-19)36-24(28,29)30/h1-11,13,32,34H,12H2
52 atoms
F  -3.98182 -6.1379 1.40081
F  -5.184116 -4.86662 0.14599
F  -4.486495 -4.14524 2.046005
F  7.004821 1.905892 1.826436
F  6.622263 3.868351 1.061624
F  8.549816 2.957267 0.753904
O  6.88959 2.192878 -0.378397
O  0.527957 2.688103 -1.974591
N  -0.750563 -0.446515 -1.268197
N  -0.678343 0.81767 -1.674656
N  1.57205 0.793748 -1.19728
N  -5.446116 4.466296 2.666939
C  -3.175089 -0.414309 -1.618765
C  -1.870347 -1.059255 -1.225338
C  -1.842226 -2.459794 -0.767235
C  -3.646743 0.667295 -0.673639
C  -2.947545 -3.024775 -0.142714
C  -2.912646 -4.335101 0.320092
C  -0.696677 -3.243204 -0.929613
C  -4.386945 1.742029 -1.159281
C  -3.376477 0.602104 0.690269
C  -1.772447 -5.101825 0.155592
C  -0.666215 -4.545603 -0.474218
C  -4.140763 -4.881509 0.983487
C  -4.853837 2.72717 -0.308507
C  -3.838599 1.580314 1.551165
C  -4.581202 2.648533 1.054807
C  2.889195 1.212388 -1.012542
C  0.516015 1.529461 -1.63294
C  3.777467 0.280625 -0.473811
C  3.361416 2.484102 -1.335964
C  5.551515 1.87427 -0.557325
C  5.101077 0.604705 -0.244096
C  4.68879 2.805584 -1.103587
C  -5.058847 3.65777 1.944925
C  7.250327 2.722407 0.799987
H  -3.073997 0.000908 -2.628299
H  -3.95197 -1.175085 -1.714085
H  -3.844227 -2.435124 0.007017
H  0.164626 -2.826043 -1.432723
H  -4.604435 1.811438 -2.218403
H  -2.791168 -0.215523 1.092252
H  -1.734224 -6.123793 0.504677
H  0.223497 -5.143887 -0.615893
H  -5.425138 3.558538 -0.697793
H  -3.621544 1.52112 2.608746
H  -1.497477 1.382155 -1.863155
H  1.3557 -0.1538 -0.926361
H  3.430618 -0.715058 -0.222938
H  2.704246 3.224164 -1.760883
H  5.777288 -0.132614 0.166319
H  5.049787 3.790916 -1.365732
totalener: -1892.93772197 hartree
nucrepener: 3570.57450599 hartree
electener: -5463.51222796 hartree
oneelecener: -9694.43515670 hartree
twoeener: 4230.92292873 hartree
kineticenergy: 1885.84625244 hartree
xcener: -170.271346592979 hartree
chargesum: 0.0000000
charge: -0.170661 -0.171044 -0.170865 -0.171717 -0.168586 -0.156451 -0.296815 -0.416572 -0.227664 -0.054355 -0.176586 -0.005494 -0.109747 0.170304 0.066850 -0.086141 -0.186228 -0.121941 -0.177658 -0.142040 -0.085999 -0.087838 -0.105547 0.542705 -0.152574 -0.175267 0.186242 0.202217 0.398438 -0.200793 -0.191712 0.148162 -0.103010 -0.091474 -0.180897 0.575117 0.120437 0.107778 0.123707 0.124421 0.123212 0.132934 0.140448 0.132743 0.138878 0.138949 0.156120 0.150234 0.097584 0.156247 0.124768 0.127182
qa: -0.1707 -0.1710 -0.1709 -0.1717 -0.1686 -0.1565 -0.2968 -0.4166 -0.2277 -0.0544 -0.1766 -0.0055 -0.1097 0.1703 0.0669 -0.0861 -0.1862 -0.1219 -0.1777 -0.1420 -0.0860 -0.0878 -0.1055 0.5427 -0.1526 -0.1753 0.1862 0.2022 0.3984 -0.2008 -0.1917 0.1482 -0.1030 -0.0915 -0.1809 0.5751 0.1204 0.1078 0.1237 0.1244 0.1232 0.1329 0.1404 0.1327 0.1389 0.1389 0.1561 0.1502 0.0976 0.1562 0.1248 0.1272
va: 1.1381 1.1300 1.1313 1.1295 1.1340 1.1533 2.1013 2.0990 3.0052 3.1788 3.2298 3.1256 3.8072 3.7127 3.7040 3.7743 4.0655 3.9603 4.0686 4.0126 3.9227 3.9553 3.9744 4.4495 4.0467 4.0878 3.7159 3.8800 4.3261 4.0090 4.0022 3.8748 4.0833 4.0277 3.9902 4.6330 1.0016 1.0065 1.0268 1.0223 1.0087 1.0083 1.0100 1.0023 1.0103 1.0118 1.0501 1.0478 1.0161 1.0332 1.0095 1.0094
dispcorr: -0.025045131 hartree
energy: -1892.962767101986
dipole: -18.82396 18.40954 -0.41442 2.48828 -4.86588 -2.37760 -17.01719 15.46834 -1.54886
magnitude: 2.86770 au
magnitude: 7.28911 debye
