program: Orca
programVersion: 5.0.2
elementType: F F F F F F O O N N N N C C C C C C C C C C C C C C C C C C C C C C C C H H H H H H H H H H H H H H H H
charge: 0
multiplicity: 1
keywords: wb97x-d3
keywords: def2-TZVPP
keywords: def2/J RIJCOSX
keywords: DEFGRID2
keywords: scfconv7
keywords: smallprint printgap noloewdin
keywords: NOSOSCF
formula: C24H16F6N4O2
InChI: InChI=1/C24H16F6N4O2/c25-23(26,27)18-3-1-2-17(13-18)21(12-15-4-6-16(14-31)7-5-15)33-34-22(35)32-19-8-10-20(11-9-19)36-24(28,29)30/h1-11,13,32,34H,12H2
52 atoms
F  -5.140123 -4.864384 0.170621
F  -4.389956 -4.282328 2.097219
F  -3.904753 -6.221595 1.295403
F  8.672083 2.694641 0.7389
F  6.995617 1.921835 1.84876
F  6.87611 3.865142 0.948432
O  6.937086 2.075892 -0.370768
O  0.541205 2.745656 -1.839652
N  -0.754234 -0.383774 -1.143024
N  -0.682366 0.882785 -1.541396
N  1.55911 0.84718 -1.037354
N  -5.729314 4.579496 2.373021
C  -3.160779 -0.408863 -1.607873
C  -1.861415 -1.019764 -1.149048
C  -1.813769 -2.426557 -0.70904
C  -3.694659 0.691828 -0.721029
C  -2.916583 -3.028807 -0.114722
C  -2.858115 -4.347413 0.323403
C  -0.647618 -3.179615 -0.866798
C  -4.414817 1.743885 -1.280791
C  -3.504911 0.667918 0.657685
C  -1.696714 -5.083358 0.16235
C  -0.593727 -4.489913 -0.437652
C  -4.073425 -4.938226 0.974672
C  -4.940821 2.74757 -0.488682
C  -4.025777 1.666259 1.460734
C  -4.747587 2.711632 0.889929
C  2.889021 1.233601 -0.881336
C  0.515334 1.589758 -1.490141
C  3.760572 0.279371 -0.354241
C  3.391128 2.488326 -1.224746
C  5.581954 1.812736 -0.505117
C  5.098677 0.5627 -0.163604
C  4.735071 2.768741 -1.033116
C  -5.288449 3.745578 1.713264
C  7.352724 2.63096 0.776616
H  -3.022395 -0.020636 -2.623944
H  -3.919118 -1.187027 -1.712481
H  -3.829421 -2.462467 0.028635
H  0.211566 -2.732548 -1.347401
H  -4.56945 1.780416 -2.352481
H  -2.936774 -0.132448 1.115752
H  -1.639386 -6.111186 0.490701
H  0.311942 -5.064408 -0.576918
H  -5.496276 3.560878 -0.934862
H  -3.870801 1.640165 2.530514
H  -1.499143 1.441522 -1.755835
H  1.32791 -0.09594 -0.763137
H  3.388547 -0.702067 -0.084195
H  2.745439 3.246005 -1.636658
H  5.762661 -0.191113 0.236713
H  5.11961 3.739979 -1.313655
totalener: -1892.93762985 hartree
nucrepener: 3563.31755176 hartree
electener: -5456.25518161 hartree
oneelecener: -9679.89847137 hartree
twoeener: 4223.64328976 hartree
kineticenergy: 1885.83822460 hartree
xcener: -170.269614838808 hartree
chargesum: -0.0000000
charge: -0.171983 -0.169924 -0.170843 -0.156676 -0.170652 -0.169819 -0.296612 -0.415421 -0.226969 -0.054250 -0.177376 -0.005382 -0.120115 0.161778 0.076034 -0.081513 -0.188555 -0.117820 -0.176188 -0.143493 -0.087296 -0.088017 -0.107491 0.541750 -0.150366 -0.173285 0.186238 0.203555 0.396233 -0.200102 -0.193011 0.147765 -0.103016 -0.091859 -0.181595 0.575161 0.122578 0.108885 0.123966 0.123727 0.123313 0.132336 0.140443 0.132548 0.138628 0.139432 0.158436 0.151251 0.097482 0.155728 0.124496 0.127867
qa: -0.1720 -0.1699 -0.1708 -0.1567 -0.1707 -0.1698 -0.2966 -0.4154 -0.2270 -0.0543 -0.1774 -0.0054 -0.1201 0.1618 0.0760 -0.0815 -0.1886 -0.1178 -0.1762 -0.1435 -0.0873 -0.0880 -0.1075 0.5417 -0.1504 -0.1733 0.1862 0.2036 0.3962 -0.2001 -0.1930 0.1478 -0.1030 -0.0919 -0.1816 0.5752 0.1226 0.1089 0.1240 0.1237 0.1233 0.1323 0.1404 0.1325 0.1386 0.1394 0.1584 0.1513 0.0975 0.1557 0.1245 0.1279
va: 1.1300 1.1310 1.1373 1.1529 1.1301 1.1331 2.1014 2.1006 3.0057 3.1766 3.2287 3.1254 3.8063 3.7109 3.6993 3.7711 4.0710 3.9549 4.0656 4.0133 3.9265 3.9551 3.9769 4.4494 4.0464 4.0831 3.7169 3.8778 4.3293 4.0073 4.0060 3.8747 4.0801 4.0328 3.9900 4.6325 1.0017 1.0066 1.0257 1.0221 1.0089 1.0090 1.0102 1.0025 1.0105 1.0114 1.0485 1.0480 1.0162 1.0328 1.0090 1.0100
dispcorr: -0.025012453 hartree
energy: -1892.962642303234
dipole: -19.51956 19.14150 -0.37806 3.26603 -5.64287 -2.37683 -16.59814 15.12362 -1.47452
magnitude: 2.82249 au
magnitude: 7.17421 debye
