program: Orca
programVersion: 5.0.2
elementType: F F F F F F O O N N N N C C C C C C C C C C C C C C C C C C C C C C C C H H H H H H H H H H H H H H H H
charge: 0
multiplicity: 1
keywords: wb97x-d3
keywords: def2-TZVPP
keywords: def2/J RIJCOSX
keywords: DEFGRID2
keywords: scfconv7
keywords: smallprint printgap noloewdin
keywords: NOSOSCF
formula: C24H16F6N4O2
InChI: InChI=1/C24H16F6N4O2/c25-23(26,27)18-3-1-2-17(13-18)21(12-15-4-6-16(14-31)7-5-15)33-34-22(35)32-19-8-10-20(11-9-19)36-24(28,29)30/h1-11,13,32,34H,12H2
52 atoms
F  -0.711964 -5.764608 -1.364162
F  0.299512 -3.864222 -1.360999
F  -1.368045 -4.192856 -2.677093
F  7.104386 0.044799 0.856971
F  7.077782 2.139226 1.307584
F  8.377516 1.391666 -0.24111
O  6.268551 1.456186 -0.648371
O  0.109552 2.97247 1.18402
N  -1.498789 -0.07785 1.021596
N  -1.289441 1.210914 1.263238
N  0.893507 0.882159 0.631723
N  -6.161849 4.900776 -2.620736
C  -3.836516 0.110564 1.735423
C  -2.631566 -0.63336 1.213884
C  -2.705045 -2.067868 0.869735
C  -4.337455 1.168766 0.779429
C  -1.833828 -2.590397 -0.085827
C  -1.838885 -3.940482 -0.392531
C  -3.597884 -2.936597 1.494107
C  -4.456403 0.894137 -0.580703
C  -4.70327 2.42802 1.244746
C  -2.728561 -4.797904 0.241858
C  -3.606087 -4.286448 1.182879
C  -0.901682 -4.446965 -1.449488
C  -4.927916 1.853055 -1.456097
C  -5.175628 3.397864 0.377011
C  -5.289645 3.112311 -0.979959
C  2.235741 1.101481 0.32821
C  -0.042111 1.784887 1.024001
C  2.965508 -0.004388 -0.11095
C  2.87647 2.334805 0.436309
C  4.933487 1.330535 -0.293332
C  4.307246 0.10393 -0.419715
C  4.223076 2.439453 0.125706
C  -5.771621 4.10493 -1.886293
C  7.184143 1.259677 0.310402
H  -4.653018 -0.583966 1.935028
H  -3.596693 0.569844 2.700527
H  -1.15313 -1.918584 -0.590389
H  -4.280158 -2.575671 2.252478
H  -4.175455 -0.078847 -0.96428
H  -4.618283 2.65883 2.300119
H  -2.743595 -5.853971 0.012317
H  -4.297491 -4.94791 1.686621
H  -5.014726 1.632088 -2.51098
H  -5.451023 4.37518 0.748683
H  -2.036723 1.868554 1.448497
H  0.564966 -0.068774 0.553749
H  2.479798 -0.96786 -0.214215
H  2.337001 3.209239 0.760671
H  4.855921 -0.760192 -0.768401
H  4.713438 3.400475 0.202536
totalener: -1892.93655192 hartree
nucrepener: 3617.66716367 hartree
electener: -5510.60371559 hartree
oneelecener: -9788.85482394 hartree
twoeener: 4278.25110834 hartree
kineticenergy: 1885.84513697 hartree
xcener: -170.271254831189 hartree
chargesum: 0.0000000
charge: -0.170535 -0.174850 -0.166493 -0.171662 -0.169993 -0.156793 -0.296209 -0.415585 -0.194192 -0.073826 -0.177998 -0.005290 -0.161365 0.163188 -0.007309 -0.051048 -0.157616 -0.066094 -0.157416 -0.094846 -0.139440 -0.099849 -0.126094 0.539121 -0.166565 -0.151823 0.185812 0.204279 0.397333 -0.201635 -0.191837 0.151953 -0.106969 -0.095049 -0.183172 0.575092 0.110227 0.125990 0.120638 0.121133 0.131444 0.130177 0.138016 0.132576 0.139334 0.139057 0.160659 0.156123 0.102304 0.154019 0.126425 0.126653
qa: -0.1705 -0.1748 -0.1665 -0.1717 -0.1700 -0.1568 -0.2962 -0.4156 -0.1942 -0.0738 -0.1780 -0.0053 -0.1614 0.1632 -0.0073 -0.0510 -0.1576 -0.0661 -0.1574 -0.0948 -0.1394 -0.0998 -0.1261 0.5391 -0.1666 -0.1518 0.1858 0.2043 0.3973 -0.2016 -0.1918 0.1520 -0.1070 -0.0950 -0.1832 0.5751 0.1102 0.1260 0.1206 0.1211 0.1314 0.1302 0.1380 0.1326 0.1393 0.1391 0.1607 0.1561 0.1023 0.1540 0.1264 0.1267
va: 1.1362 1.1255 1.1298 1.1294 1.1323 1.1528 2.1014 2.1010 3.0219 3.1820 3.2303 3.1255 3.8525 3.7208 3.7557 3.7319 4.0675 3.8727 4.0142 3.9477 3.9591 3.9838 3.9984 4.4411 4.0557 4.0614 3.7135 3.8729 4.3261 4.0084 4.0060 3.8686 4.0854 4.0310 3.9917 4.6331 1.0109 1.0059 1.0419 1.0122 1.0035 1.0078 1.0116 1.0030 1.0108 1.0103 1.0508 1.0442 1.0199 1.0330 1.0093 1.0097
dispcorr: -0.025173826 hartree
energy: -1892.961725746284
dipole: -44.60666 42.46587 -2.14079 9.67626 -11.78340 -2.10714 12.18016 -10.40437 1.77579
magnitude: 3.48948 au
magnitude: 8.86954 debye
