program: Orca
programVersion: 5.0.2
elementType: F F F F F F O O N N N N C C C C C C C C C C C C C C C C C C C C C C C C H H H H H H H H H H H H H H H H
charge: 0
multiplicity: 1
keywords: wb97x-d3
keywords: def2-TZVPP
keywords: def2/J RIJCOSX
keywords: DEFGRID2
keywords: scfconv7
keywords: smallprint printgap noloewdin
keywords: NOSOSCF
formula: C24H16F6N4O2
InChI: InChI=1/C24H16F6N4O2/c25-23(26,27)18-3-1-2-17(13-18)21(12-15-4-6-16(14-31)7-5-15)33-34-22(35)32-19-8-10-20(11-9-19)36-24(28,29)30/h1-11,13,32,34H,12H2
52 atoms
F  -0.842497 -6.261382 1.133464
F  0.408175 -4.7077 0.319168
F  -0.828867 -5.883446 -0.98562
F  6.374022 3.235775 1.092206
F  8.134319 2.009321 0.897211
F  6.438741 1.304802 2.022501
O  6.380262 1.423873 -0.19942
O  0.128552 2.506927 -1.958423
N  -1.51674 -0.344214 -0.902715
N  -1.291057 0.830184 -1.485191
N  0.933802 0.606384 -0.945821
N  -5.606327 5.803836 1.70296
C  -3.915455 -0.121268 -1.359639
C  -2.697136 -0.822574 -0.814731
C  -2.831196 -2.14265 -0.171943
C  -4.264556 1.178478 -0.67262
C  -1.793307 -3.068561 -0.243533
C  -1.904977 -4.304853 0.371625
C  -3.983623 -2.48583 0.53318
C  -4.012277 1.374749 0.682114
C  -4.870148 2.202503 -1.396501
C  -3.056341 -4.636596 1.074296
C  -4.090188 -3.718725 1.154369
C  -0.788774 -5.294853 0.214828
C  -4.3573 2.562419 1.301305
C  -5.220865 3.393755 -0.788813
C  -4.964918 3.578357 0.567622
C  2.291248 0.881347 -0.78339
C  -0.022022 1.403884 -1.489001
C  2.903401 2.072629 -1.171463
C  3.06852 -0.115863 -0.192639
C  5.012419 1.258117 -0.358502
C  4.260275 2.25214 -0.955156
C  4.420793 0.067455 0.022876
C  -5.318055 4.8097 1.198992
C  6.813626 1.985706 0.938122
H  -3.758737 0.065578 -2.428647
H  -4.775516 -0.7921 -1.31967
H  -0.903653 -2.812086 -0.803002
H  -4.802487 -1.782364 0.62204
H  -3.527957 0.599844 1.263519
H  -5.069381 2.068936 -2.453001
H  -3.154854 -5.598417 1.557442
H  -4.985763 -3.966468 1.707452
H  -4.150961 2.707625 2.352745
H  -5.686079 4.183205 -1.362795
H  -2.036522 1.45688 -1.763052
H  0.605119 -0.276731 -0.584626
H  2.333375 2.858746 -1.637788
H  2.612504 -1.052277 0.106809
H  4.730339 3.174115 -1.269609
H  5.010369 -0.719451 0.472967
totalener: -1892.93776837 hartree
nucrepener: 3595.08309151 hartree
electener: -5488.02085988 hartree
oneelecener: -9743.63440178 hartree
twoeener: 4255.61354190 hartree
kineticenergy: 1885.83583779 hartree
xcener: -170.268817779919 hartree
chargesum: 0.0000000
charge: -0.171242 -0.174859 -0.166190 -0.169877 -0.156929 -0.171128 -0.296413 -0.416605 -0.224251 -0.057094 -0.175667 -0.005574 -0.140491 0.162910 0.069067 -0.067231 -0.167857 -0.074426 -0.184311 -0.094762 -0.141667 -0.094641 -0.144907 0.538213 -0.172651 -0.151303 0.188574 0.201995 0.396518 -0.193333 -0.201012 0.149441 -0.092664 -0.104725 -0.180798 0.574730 0.125062 0.108078 0.120119 0.130630 0.131887 0.122787 0.138044 0.133561 0.138567 0.138957 0.158895 0.153109 0.155791 0.102353 0.127442 0.125879
qa: -0.1712 -0.1749 -0.1662 -0.1699 -0.1569 -0.1711 -0.2964 -0.4166 -0.2243 -0.0571 -0.1757 -0.0056 -0.1405 0.1629 0.0691 -0.0672 -0.1679 -0.0744 -0.1843 -0.0948 -0.1417 -0.0946 -0.1449 0.5382 -0.1727 -0.1513 0.1886 0.2020 0.3965 -0.1933 -0.2010 0.1494 -0.0927 -0.1047 -0.1808 0.5747 0.1251 0.1081 0.1201 0.1306 0.1319 0.1228 0.1380 0.1336 0.1386 0.1390 0.1589 0.1531 0.1558 0.1024 0.1274 0.1259
va: 1.1354 1.1274 1.1303 1.1326 1.1524 1.1300 2.1015 2.0992 3.0013 3.1729 3.2317 3.1242 3.8130 3.7081 3.7046 3.7623 4.1164 3.8749 4.0076 3.9264 4.0153 3.9787 4.0334 4.4452 4.0796 4.0450 3.7153 3.8777 4.3281 4.0042 4.0084 3.8720 4.0302 4.0849 3.9889 4.6336 1.0020 1.0058 1.0417 1.0029 1.0097 1.0090 1.0116 1.0031 1.0117 1.0105 1.0491 1.0457 1.0331 1.0174 1.0098 1.0091
dispcorr: -0.025029367 hartree
energy: -1892.962797737786
dipole: -43.91443 41.58124 -2.33319 9.90722 -12.02978 -2.12255 -9.27593 8.70498 -0.57095
magnitude: 3.20546 au
magnitude: 8.14763 debye
