program: Orca
programVersion: 5.0.2
elementType: F F F F F F O O N N N N C C C C C C C C C C C C C C C C C C C C C C C C H H H H H H H H H H H H H H H H
charge: 0
multiplicity: 1
keywords: wb97x-d3
keywords: def2-TZVPP
keywords: def2/J RIJCOSX
keywords: DEFGRID2
keywords: scfconv7
keywords: smallprint printgap noloewdin
keywords: NOSOSCF
formula: C24H16F6N4O2
InChI: InChI=1/C24H16F6N4O2/c25-23(26,27)18-3-1-2-17(13-18)21(12-15-4-6-16(14-31)7-5-15)33-34-22(35)32-19-8-10-20(11-9-19)36-24(28,29)30/h1-11,13,32,34H,12H2
52 atoms
F  0.557082 -4.435526 -0.381305
F  -0.684334 -6.146833 -0.784636
F  -0.426604 -5.451643 1.236068
F  7.095404 -0.073286 0.279036
F  7.130233 1.864485 1.193225
F  8.399028 1.455136 -0.497797
O  6.289349 1.662977 -0.857209
O  0.157187 2.922264 1.233912
N  -1.496133 -0.047883 0.602926
N  -1.265215 1.190381 1.028493
N  0.899815 0.956418 0.299196
N  -6.706456 5.375739 -1.9012
C  -3.815072 0.075681 1.396268
C  -2.640253 -0.597429 0.734786
C  -2.762973 -1.985769 0.251942
C  -4.399962 1.252819 0.652123
C  -1.665529 -2.842035 0.291181
C  -1.766621 -4.144858 -0.170163
C  -3.966603 -2.465773 -0.261491
C  -5.014648 2.279931 1.364338
C  -4.377068 1.322632 -0.737615
C  -2.967672 -4.611213 -0.689094
C  -4.062511 -3.763251 -0.735791
C  -0.577924 -5.050981 -0.031399
C  -5.607055 3.344803 0.71213
C  -4.964634 2.384528 -1.402123
C  -5.587034 3.399207 -0.679503
C  2.247044 1.202913 0.040535
C  -0.015125 1.783986 0.867701
C  2.958523 0.183278 -0.593705
C  2.911171 2.38228 0.374649
C  4.952093 1.491897 -0.529348
C  4.302799 0.321522 -0.879211
C  4.261073 2.51597 0.089724
C  -6.20263 4.494258 -1.358558
C  7.204979 1.231664 0.02189
H  -4.603044 -0.659357 1.572439
H  -3.507982 0.398543 2.398217
H  -0.735993 -2.478421 0.70845
H  -4.835565 -1.820716 -0.315027
H  -5.034721 2.245957 2.446961
H  -3.889308 0.54613 -1.314103
H  -3.059885 -5.62489 -1.052697
H  -4.998636 -4.118067 -1.144863
H  -6.081865 4.13551 1.276474
H  -4.940014 2.430856 -2.482203
H  -1.998368 1.809588 1.351929
H  0.549083 0.048748 0.031482
H  2.456344 -0.736421 -0.870487
H  2.387307 3.192495 0.854217
H  4.83415 -0.47411 -1.382934
H  4.770148 3.435591 0.344965
totalener: -1892.93772098 hartree
nucrepener: 3588.02449155 hartree
electener: -5480.96221253 hartree
oneelecener: -9729.47007121 hartree
twoeener: 4248.50785869 hartree
kineticenergy: 1885.82832479 hartree
xcener: -170.267163587883 hartree
chargesum: -0.0000000
charge: -0.174860 -0.171034 -0.166227 -0.171823 -0.169293 -0.156852 -0.296034 -0.415218 -0.224996 -0.052324 -0.175432 -0.005486 -0.137587 0.163283 0.073108 -0.077394 -0.169727 -0.075304 -0.186788 -0.136154 -0.088510 -0.096951 -0.141018 0.539021 -0.155283 -0.178242 0.187626 0.202022 0.392226 -0.201223 -0.190714 0.150114 -0.102270 -0.095289 -0.179433 0.574595 0.109275 0.123766 0.118924 0.131613 0.122688 0.133296 0.138998 0.133087 0.139030 0.139172 0.158123 0.153340 0.102146 0.153497 0.125289 0.127227
qa: -0.1749 -0.1710 -0.1662 -0.1718 -0.1693 -0.1569 -0.2960 -0.4152 -0.2250 -0.0523 -0.1754 -0.0055 -0.1376 0.1633 0.0731 -0.0774 -0.1697 -0.0753 -0.1868 -0.1362 -0.0885 -0.0970 -0.1410 0.5390 -0.1553 -0.1782 0.1876 0.2020 0.3922 -0.2012 -0.1907 0.1501 -0.1023 -0.0953 -0.1794 0.5746 0.1093 0.1238 0.1189 0.1316 0.1227 0.1333 0.1390 0.1331 0.1390 0.1392 0.1581 0.1533 0.1021 0.1535 0.1253 0.1272
va: 1.1274 1.1363 1.1307 1.1289 1.1332 1.1526 2.1015 2.1010 3.0052 3.1708 3.2290 3.1246 3.8110 3.6999 3.7000 3.7634 4.1178 3.8792 4.0086 4.0132 3.9184 3.9761 4.0321 4.4451 4.0478 4.0835 3.7132 3.8771 4.3347 4.0079 4.0038 3.8708 4.0795 4.0329 3.9891 4.6336 1.0048 1.0017 1.0420 1.0027 1.0088 1.0094 1.0111 1.0033 1.0105 1.0115 1.0472 1.0464 1.0176 1.0330 1.0098 1.0092
dispcorr: -0.024975264 hartree
energy: -1892.962696245286
dipole: -47.21262 45.04930 -2.16331 14.36994 -16.27947 -1.90953 1.05827 -0.47657 0.58170
magnitude: 2.94357 au
magnitude: 7.48196 debye
