program: Orca
programVersion: 5.0.2
elementType: F F F F F F O O N N N N C C C C C C C C C C C C C C C C C C C C C C C C H H H H H H H H H H H H H H H H
charge: 0
multiplicity: 1
keywords: wb97x-d3
keywords: def2-TZVPP
keywords: def2/J RIJCOSX
keywords: DEFGRID2
keywords: scfconv7
keywords: smallprint printgap noloewdin
keywords: NOSOSCF
formula: C24H16F6N4O2
InChI: InChI=1/C24H16F6N4O2/c25-23(26,27)18-3-1-2-17(13-18)21(12-15-4-6-16(14-31)7-5-15)33-34-22(35)32-19-8-10-20(11-9-19)36-24(28,29)30/h1-11,13,32,34H,12H2
52 atoms
F  -5.376094 -4.073152 -0.798375
F  -5.232184 -3.699118 1.311486
F  -4.698854 -5.63175 0.527721
F  9.376541 2.108182 0.41299
F  7.927904 3.066088 -0.86185
F  8.175741 0.940586 -0.943119
O  7.297939 1.845252 0.890343
O  1.153716 2.960233 -1.128666
N  -0.450435 -0.083549 -0.728544
N  -0.210078 1.177434 -1.084101
N  1.926106 0.981677 -0.2512
N  -7.710584 3.024726 1.757906
C  -2.66961 -0.018181 -1.80165
C  -1.558801 -0.653613 -1.006675
C  -1.746888 -2.034293 -0.521706
C  -3.755927 0.642148 -0.984018
C  -3.028633 -2.549865 -0.365065
C  -3.22534 -3.841858 0.106489
C  -0.658439 -2.846902 -0.198233
C  -5.028277 0.776842 -1.535089
C  -3.526654 1.12881 0.2986
C  -2.139112 -4.640215 0.422133
C  -0.855322 -4.132871 0.2642
C  -4.635244 -4.321032 0.288899
C  -6.047849 1.388858 -0.832737
C  -4.540732 1.744601 1.012477
C  -5.806062 1.879083 0.449106
C  3.265821 1.267061 0.015631
C  1.006248 1.799145 -0.828259
C  4.09471 0.189984 0.330399
C  3.807428 2.551874 -0.000669
C  5.962742 1.656999 0.566514
C  5.436975 0.378544 0.601156
C  5.151641 2.738474 0.276388
C  -6.858656 2.51092 1.178517
C  8.172066 1.986234 -0.116669
H  -2.260178 0.709206 -2.511354
H  -3.118998 -0.78638 -2.434534
H  -3.890754 -1.935935 -0.591094
H  0.346099 -2.469019 -0.328298
H  -5.226437 0.392537 -2.528258
H  -2.554056 1.019488 0.761698
H  -2.275865 -5.649769 0.782947
H  -0.002848 -4.755352 0.499629
H  -7.032375 1.483243 -1.269535
H  -4.352975 2.117109 2.010054
H  -0.919068 1.781881 -1.479249
H  1.619804 0.0359 -0.080513
H  3.691252 -0.815546 0.353725
H  3.192325 3.406202 -0.228718
H  6.067789 -0.465497 0.844637
H  5.556774 3.740905 0.277235
totalener: -1892.93670874 hartree
nucrepener: 3552.18591563 hartree
electener: -5445.12262437 hartree
oneelecener: -9657.57308848 hartree
twoeener: 4212.45046411 hartree
kineticenergy: 1885.82900528 hartree
xcener: -170.268922402678 hartree
chargesum: -0.0000000
charge: -0.175476 -0.166652 -0.171139 -0.156440 -0.170997 -0.169397 -0.295756 -0.415245 -0.225480 -0.062486 -0.185753 -0.006091 -0.142033 0.197217 0.053129 -0.038886 -0.197682 -0.089349 -0.178793 -0.131155 -0.095340 -0.100235 -0.096339 0.539191 -0.164099 -0.179708 0.191170 0.199465 0.397889 -0.191001 -0.186396 0.146766 -0.111516 -0.084381 -0.184808 0.575863 0.103451 0.117928 0.124974 0.117447 0.120840 0.134613 0.139983 0.131250 0.138136 0.139020 0.148373 0.153417 0.098850 0.151247 0.124968 0.127447
qa: -0.1755 -0.1667 -0.1711 -0.1564 -0.1710 -0.1694 -0.2958 -0.4152 -0.2255 -0.0625 -0.1858 -0.0061 -0.1420 0.1972 0.0531 -0.0389 -0.1977 -0.0893 -0.1788 -0.1312 -0.0953 -0.1002 -0.0963 0.5392 -0.1641 -0.1797 0.1912 0.1995 0.3979 -0.1910 -0.1864 0.1468 -0.1115 -0.0844 -0.1848 0.5759 0.1035 0.1179 0.1250 0.1174 0.1208 0.1346 0.1400 0.1313 0.1381 0.1390 0.1484 0.1534 0.0989 0.1512 0.1250 0.1274
va: 1.1265 1.1330 1.1365 1.1533 1.1309 1.1325 2.1021 2.0998 2.9757 3.1636 3.2195 3.1266 3.8585 3.6777 3.7629 3.7468 4.0604 3.9365 4.0686 4.0067 3.9229 3.9634 3.9656 4.4455 4.0529 4.0984 3.7131 3.8606 4.3319 4.0131 4.0148 3.8799 4.0938 4.0232 3.9946 4.6315 1.0030 1.0059 1.0394 1.0227 1.0083 1.0100 1.0105 1.0021 1.0107 1.0111 1.0505 1.0468 1.0141 1.0334 1.0088 1.0111
dispcorr: -0.024991970 hartree
energy: -1892.961700711897
dipole: -19.74091 19.97877 0.23786 5.19476 -7.00074 -1.80598 -4.30971 3.31511 -0.99460
magnitude: 2.07542 au
magnitude: 5.27531 debye
