program: Orca
programVersion: 5.0.2
elementType: F F F F F F O O N N N N C C C C C C C C C C C C C C C C C C C C C C C C H H H H H H H H H H H H H H H H
charge: 0
multiplicity: 1
keywords: wb97x-d3
keywords: def2-TZVPP
keywords: def2/J RIJCOSX
keywords: DEFGRID2
keywords: scfconv7
keywords: smallprint printgap noloewdin
keywords: NOSOSCF
formula: C24H16F6N4O2
InChI: InChI=1/C24H16F6N4O2/c25-23(26,27)18-3-1-2-17(13-18)21(12-15-4-6-16(14-31)7-5-15)33-34-22(35)32-19-8-10-20(11-9-19)36-24(28,29)30/h1-11,13,32,34H,12H2
52 atoms
F  -0.510681 -5.596615 1.138046
F  -1.972513 -4.890556 2.542656
F  -0.300885 -3.639912 2.011013
F  8.418926 1.671901 0.161881
F  6.90924 0.678564 1.334113
F  6.700286 2.761321 0.873637
O  6.526064 1.276611 -0.774577
O  0.18165 2.911748 -1.438914
N  -1.462751 -0.112022 -1.123027
N  -1.246908 1.178913 -1.359811
N  0.996924 0.798038 -1.043805
N  -6.060401 4.705983 2.944775
C  -3.82983 0.158072 -1.710885
C  -2.622671 -0.627456 -1.259403
C  -2.738964 -2.059143 -0.919894
C  -4.301637 1.161896 -0.683911
C  -1.932578 -2.595986 0.086127
C  -2.006477 -3.938745 0.408044
C  -3.62252 -2.902363 -1.586772
C  -4.469523 0.787166 0.647339
C  -4.595043 2.470094 -1.054897
C  -2.884879 -4.775065 -0.274138
C  -3.687006 -4.250988 -1.270595
C  -1.188358 -4.51237 1.52738
C  -4.923337 1.695203 1.584297
C  -5.046536 3.390191 -0.12439
C  -5.21355 3.00409 1.201623
C  2.374243 0.995249 -0.959376
C  0.03104 1.723043 -1.282226
C  3.153912 -0.12411 -0.664358
C  3.005575 2.220732 -1.168829
C  5.141865 1.188788 -0.789882
C  4.530111 -0.033119 -0.577736
C  4.385185 2.307606 -1.08312
C  -5.680747 3.946373 2.167642
C  7.118524 1.592901 0.38503
H  -3.605131 0.671825 -2.65173
H  -4.655546 -0.518672 -1.93296
H  -1.262331 -1.937478 0.620081
H  -4.252012 -2.522347 -2.381053
H  -4.246054 -0.225943 0.958378
H  -4.472953 2.779173 -2.086456
H  -2.950259 -5.827043 -0.029664
H  -4.36845 -4.896015 -1.808054
H  -5.052635 1.395266 2.615124
H  -5.267153 4.405566 -0.423421
H  -1.994631 1.854973 -1.451427
H  0.667389 -0.148551 -0.924708
H  2.681119 -1.085285 -0.499941
H  2.432735 3.103492 -1.398883
H  5.120076 -0.913099 -0.360702
H  4.869304 3.257787 -1.263429
totalener: -1892.93682261 hartree
nucrepener: 3599.62416949 hartree
electener: -5492.56099211 hartree
oneelecener: -9752.76716863 hartree
twoeener: 4260.20617652 hartree
kineticenergy: 1885.84017893 hartree
xcener: -170.269346215546 hartree
chargesum: -0.0000000
charge: -0.171001 -0.168271 -0.172678 -0.157172 -0.171274 -0.169330 -0.296539 -0.418724 -0.202262 -0.070317 -0.177713 -0.004921 -0.162194 0.174987 -0.009393 -0.038960 -0.148107 -0.081737 -0.145580 -0.098975 -0.144941 -0.108662 -0.137376 0.541919 -0.167135 -0.148157 0.181117 0.202879 0.399743 -0.200646 -0.193051 0.150816 -0.106607 -0.092826 -0.183612 0.574844 0.122670 0.110767 0.135426 0.122133 0.134498 0.132081 0.128871 0.132590 0.139369 0.139320 0.161184 0.153522 0.102510 0.154930 0.125744 0.126241
qa: -0.1710 -0.1683 -0.1727 -0.1572 -0.1713 -0.1693 -0.2965 -0.4187 -0.2023 -0.0703 -0.1777 -0.0049 -0.1622 0.1750 -0.0094 -0.0390 -0.1481 -0.0817 -0.1456 -0.0990 -0.1449 -0.1087 -0.1374 0.5419 -0.1671 -0.1482 0.1811 0.2029 0.3997 -0.2006 -0.1931 0.1508 -0.1066 -0.0928 -0.1836 0.5748 0.1227 0.1108 0.1354 0.1221 0.1345 0.1321 0.1289 0.1326 0.1394 0.1393 0.1612 0.1535 0.1025 0.1549 0.1257 0.1262
va: 1.1331 1.1306 1.1338 1.1521 1.1305 1.1327 2.1016 2.0967 3.0170 3.1725 3.2311 3.1263 3.8641 3.7206 3.7316 3.7128 3.9666 3.8814 4.0049 3.9503 3.9588 4.0342 3.9936 4.4455 4.0557 4.0638 3.7192 3.8778 4.3219 4.0100 4.0034 3.8705 4.0888 4.0280 3.9926 4.6336 1.0080 1.0103 1.0391 1.0106 0.9997 1.0075 1.0134 1.0029 1.0107 1.0103 1.0513 1.0461 1.0164 1.0335 1.0095 1.0099
dispcorr: -0.024882634 hartree
energy: -1892.961705246855
dipole: -42.29703 40.21994 -2.07709 7.93782 -10.01649 -2.07866 -19.86063 17.78404 -2.07659
magnitude: 3.59825 au
magnitude: 9.14603 debye
