program: Orca
programVersion: 5.0.2
elementType: Cl F F F O O O O O O O N N N C C C C C C C C C C C C C C C C C C C C C C H H H H H H H H H H H H H H H H H
charge: 0
multiplicity: 1
keywords: wb97x-d3
keywords: def2-TZVPP
keywords: def2/J RIJCOSX
keywords: DEFGRID2
keywords: scfconv7
keywords: smallprint printgap noloewdin
keywords: NOSOSCF
formula: C22H17ClF3N3O7
InChI: InChI=1/C22H17ClF3N3O7/c1-33-18(30)21-10-12-9-13(23)3-8-16(12)17(21)27-28(11-35-21)19(31)29(20(32)34-2)14-4-6-15(7-5-14)36-22(24,25)26/h3-9H,10-11H2,1-2H3
53 atoms
Cl -4.133566 -4.130301 4.406935
F  0.724933 7.95871 -2.601365
F  0.245812 6.958028 -0.754428
F  -0.628616 6.286169 -2.590222
O  1.408649 -3.587348 -0.643852
O  -2.043272 -3.673433 -1.426591
O  -0.299622 -4.530178 -2.537466
O  3.015093 -0.014862 -1.617737
O  2.084606 -0.244392 1.909891
O  0.738885 1.55074 1.992087
O  1.557963 6.000994 -2.277275
N  0.286293 -1.212969 0.126305
N  1.372173 -1.239554 -0.68066
N  1.786353 0.951282 0.051144
C  0.042505 -3.61868 -0.333375
C  -0.313195 -4.626661 0.784615
C  -0.355981 -2.298619 0.276465
C  -1.371913 -3.900708 1.571476
C  -1.378916 -2.537801 1.27835
C  -0.775685 -3.983596 -1.576253
C  1.73814 -2.452352 -1.406202
C  -2.219193 -4.412386 2.535989
C  -2.208679 -1.656076 1.952037
C  -3.059008 -3.523009 3.194588
C  -3.063978 -2.159337 2.918686
C  2.132864 -0.116936 -0.791113
C  -2.951089 -4.040001 -2.474357
C  1.709646 2.244614 -0.530417
C  1.453506 0.789115 1.389967
C  0.987672 2.428661 -1.701777
C  2.367167 3.315072 0.060912
C  0.929862 3.679586 -2.294236
C  2.283819 4.575446 -0.506259
C  1.571102 4.740577 -1.680378
C  1.65602 -0.683123 3.201275
C  0.487641 6.779397 -2.052303
H  -0.636071 -5.597898 0.409531
H  0.572053 -4.790351 1.404249
H  2.81353 -2.467063 -1.55848
H  1.241896 -2.454459 -2.380817
H  -2.222918 -5.466905 2.778249
H  -2.20324 -0.597632 1.728131
H  -3.730623 -1.496917 3.453275
H  -2.708828 -3.518096 -3.400413
H  -2.943013 -5.116975 -2.642789
H  -3.935279 -3.73382 -2.13112
H  0.464582 1.599213 -2.160665
H  2.950395 3.173744 0.961232
H  0.391598 3.811873 -3.222975
H  2.794369 5.413193 -0.05051
H  2.220408 -1.587204 3.408942
H  1.874912 0.0623 3.964899
H  0.590558 -0.914183 3.20562
elementType: Cl F O N C H
totalener: -2299.38013675 hartree
nucrepener: 4175.96365201 hartree
electener: -6475.34378876 hartree
twoeener: 4990.53635774 hartree
cpcmener: -0.05647022 hartree
kineticenergy: 2291.66973198 hartree
xcener: -187.205306216613 hartree
chargesum: -0.0000000
charge: -0.087916 -0.165267 -0.172858 -0.174424 -0.358733 -0.266210 -0.445401 -0.481837 -0.291340 -0.473768 -0.311762 -0.262811 0.080896 -0.042090 0.503150 -0.132614 0.157692 -0.101936 -0.057926 0.321412 0.044058 -0.154265 -0.271137 0.114535 -0.104342 0.333590 -0.141106 0.094633 0.502313 -0.202605 -0.217435 -0.108759 -0.121993 0.203301 -0.126593 0.591728 0.120651 0.106252 0.132950 0.136386 0.141243 0.151280 0.145397 0.125348 0.122831 0.127175 0.161723 0.162742 0.157855 0.157920 0.132215 0.129750 0.116100
qa: -0.0879 -0.1653 -0.1729 -0.1744 -0.3587 -0.2662 -0.4454 -0.4818 -0.2913 -0.4738 -0.3118 -0.2628 0.0809 -0.0421 0.5032 -0.1326 0.1577 -0.1019 -0.0579 0.3214 0.0441 -0.1543 -0.2711 0.1145 -0.1043 0.3336 -0.1411 0.0946 0.5023 -0.2026 -0.2174 -0.1088 -0.1220 0.2033 -0.1266 0.5917 0.1207 0.1063 0.1329 0.1364 0.1412 0.1513 0.1454 0.1253 0.1228 0.1272 0.1617 0.1627 0.1579 0.1579 0.1322 0.1298 0.1161
va: 1.2174 1.1410 1.1272 1.1257 2.0368 2.1796 2.0620 2.0253 2.1104 2.0296 2.0795 2.9451 3.1256 3.0235 3.8492 3.9470 3.7526 3.8834 3.5556 4.1882 3.9842 4.0366 4.0234 3.8479 3.9570 4.3051 3.8673 3.6665 4.2687 4.0229 4.0338 3.9871 4.0089 3.7370 3.8512 4.6113 1.0032 1.0213 0.9958 0.9908 1.0124 1.0148 1.0059 0.9900 0.9906 0.9950 0.9997 1.0000 1.0014 0.9980 0.9945 0.9956 0.9863
dispcorr: -0.031364326 hartree
energy: -2299.411501075424
dipole: 2.91805 -4.51964 -1.60160 -36.43650 33.75879 -2.67771 2.77917 -1.90499 0.87418
magnitude: 3.24028 au
magnitude: 8.23614 debye
