program: Orca
programVersion: 5.0.2
elementType: Cl F F F O O O O O O O N N N C C C C C C C C C C C C C C C C C C C C C C H H H H H H H H H H H H H H H H H
charge: 0
multiplicity: 1
keywords: wb97x-d3
keywords: def2-TZVPP
keywords: def2/J RIJCOSX
keywords: DEFGRID2
keywords: scfconv7
keywords: smallprint printgap noloewdin
keywords: NOSOSCF
formula: C22H17ClF3N3O7
InChI: InChI=1/C22H17ClF3N3O7/c1-33-18(30)21-10-12-9-13(23)3-8-16(12)17(21)27-28(11-35-21)19(31)29(20(32)34-2)14-4-6-15(7-5-14)36-22(24,25)26/h3-9H,10-11H2,1-2H3
53 atoms
Cl -4.096828 -4.168161 4.404583
F  -0.680654 6.40323 -2.386881
F  0.713539 8.042881 -2.431763
F  0.321802 6.993989 -0.590229
O  1.424911 -3.576013 -0.670495
O  -2.023956 -3.73736 -1.434614
O  -0.277221 -4.624161 -2.512703
O  2.950321 0.016248 -1.698327
O  2.061409 -0.255541 1.841778
O  0.732903 1.549351 1.960134
O  1.514129 6.056496 -2.221263
N  0.253445 -1.215622 0.072731
N  1.3360 -1.231978 -0.740707
N  1.739969 0.957329 -0.003236
C  0.064124 -3.634699 -0.343523
C  -0.254509 -4.62666 0.799669
C  -0.362913 -2.313153 0.243456
C  -1.332861 -3.915278 1.573002
C  -1.378939 -2.559648 1.250984
C  -0.755766 -4.046142 -1.571398
C  1.714103 -2.445467 -1.456169
C  -2.166355 -4.431536 2.547253
C  -2.237204 -1.689193 1.903292
C  -3.035298 -3.554155 3.183485
C  -3.080767 -2.197596 2.877702
C  2.082453 -0.100583 -0.858031
C  -2.92965 -4.158154 -2.464207
C  1.677391 2.261769 -0.563302
C  1.431111 0.786596 1.340187
C  2.386911 3.304376 0.017329
C  0.911483 2.483378 -1.699158
C  2.306798 4.578052 -0.520335
C  0.852844 3.748103 -2.261619
C  1.54065 4.78294 -1.654104
C  1.646082 -0.706799 3.133405
C  0.479686 6.851771 -1.905626
H  -0.547864 -5.616503 0.449597
H  0.638163 -4.746603 1.418757
H  2.786081 -2.438982 -1.631388
H  1.198052 -2.474307 -2.420089
H  -2.138445 -5.480313 2.81173
H  -2.264437 -0.636201 1.656724
H  -3.770045 -1.544176 3.394418
H  -2.682992 -3.689555 -3.416014
H  -2.923113 -5.242052 -2.57143
H  -3.913535 -3.831277 -2.142449
H  3.006864 3.13079 0.886969
H  0.352587 1.67392 -2.151167
H  2.858602 5.393986 -0.073136
H  0.276354 3.913844 -3.161439
H  2.188729 -1.630058 3.31177
H  1.90178 0.017841 3.905344
H  0.574896 -0.907702 3.15606
elementType: Cl F O N C H
totalener: -2299.38017590 hartree
nucrepener: 4174.68725920 hartree
electener: -6474.06743510 hartree
twoeener: 4989.27244681 hartree
cpcmener: -0.05685255 hartree
kineticenergy: 2291.67439846 hartree
xcener: -187.205911936676 hartree
chargesum: 0.0000000
charge: -0.088154 -0.174330 -0.165482 -0.172826 -0.358179 -0.265418 -0.445947 -0.484167 -0.290963 -0.473624 -0.311361 -0.263508 0.078354 -0.041209 0.495308 -0.126278 0.162650 -0.104442 -0.060102 0.319731 0.045341 -0.154636 -0.268263 0.115223 -0.106491 0.339042 -0.140969 0.088670 0.501744 -0.218642 -0.201671 -0.117913 -0.108566 0.202755 -0.128156 0.591474 0.120571 0.106302 0.132545 0.135526 0.141363 0.151328 0.145678 0.124935 0.123466 0.127224 0.163070 0.162244 0.158923 0.158016 0.132345 0.131324 0.116147
qa: -0.0882 -0.1743 -0.1655 -0.1728 -0.3582 -0.2654 -0.4459 -0.4842 -0.2910 -0.4736 -0.3114 -0.2635 0.0784 -0.0412 0.4953 -0.1263 0.1626 -0.1044 -0.0601 0.3197 0.0453 -0.1546 -0.2683 0.1152 -0.1065 0.3390 -0.1410 0.0887 0.5017 -0.2186 -0.2017 -0.1179 -0.1086 0.2028 -0.1282 0.5915 0.1206 0.1063 0.1325 0.1355 0.1414 0.1513 0.1457 0.1249 0.1235 0.1272 0.1631 0.1622 0.1589 0.1580 0.1323 0.1313 0.1161
va: 1.2170 1.1260 1.1406 1.1271 2.0363 2.1803 2.0616 2.0234 2.1097 2.0302 2.0797 2.9404 3.1250 3.0195 3.8623 3.9413 3.7398 3.8867 3.5489 4.1897 3.9863 4.0383 4.0247 3.8465 3.9582 4.3031 3.8673 3.6558 4.2701 4.0376 4.0289 4.0002 3.9871 3.7394 3.8509 4.6113 1.0033 1.0214 0.9962 0.9905 1.0123 1.0141 1.0059 0.9903 0.9905 0.9951 0.9998 0.9997 0.9975 1.0011 0.9944 0.9953 0.9866
dispcorr: -0.031412820 hartree
energy: -2299.411588715328
dipole: 2.92060 -4.49311 -1.57251 -37.01134 34.31290 -2.69845 1.90820 -1.05595 0.85225
magnitude: 3.23739 au
magnitude: 8.22880 debye
