program: Orca
programVersion: 5.0.2
elementType: Cl F F F O O O O O O O N N N C C C C C C C C C C C C C C C C C C C C C C H H H H H H H H H H H H H H H H H
charge: 0
multiplicity: 1
keywords: wb97x-d3
keywords: def2-TZVPP
keywords: def2/J RIJCOSX
keywords: DEFGRID2
keywords: scfconv7
keywords: smallprint printgap noloewdin
keywords: NOSOSCF
formula: C22H17ClF3N3O7
InChI: InChI=1/C22H17ClF3N3O7/c1-33-18(30)21-10-12-9-13(23)3-8-16(12)17(21)27-28(11-35-21)19(31)29(20(32)34-2)14-4-6-15(7-5-14)36-22(24,25)26/h3-9H,10-11H2,1-2H3
53 atoms
Cl -5.884465 -4.125227 1.090054
F  1.350145 8.320445 0.438428
F  0.348236 6.751216 1.514277
F  0.059095 6.938614 -0.599699
O  1.503434 -3.024969 1.812084
O  -0.007362 -4.37489 -1.078784
O  1.912566 -4.964648 -0.091364
O  3.408008 0.173514 0.13395
O  0.851569 -0.745946 -2.241647
O  -0.445461 1.082304 -2.09527
O  2.057952 6.309827 0.153755
N  0.211449 -1.114563 0.354377
N  1.557781 -1.056295 0.497565
N  1.445889 0.869459 -0.828151
C  0.412194 -3.454279 1.040833
C  -0.651481 -4.222196 1.860504
C  -0.336263 -2.239779 0.567151
C  -1.950862 -3.692021 1.314214
C  -1.756647 -2.516107 0.592311
C  0.879396 -4.348258 -0.110652
C  2.342031 -2.13505 1.125874
C  -3.223799 -4.202925 1.484163
C  -2.817031 -1.818638 0.034834
C  -4.279659 -3.504332 0.912125
C  -4.095519 -2.325118 0.195714
C  2.223773 -0.013966 -0.056862
C  0.269392 -5.197647 -2.220324
C  1.586039 2.258617 -0.5804
C  0.50876 0.43006 -1.751806
C  1.767771 3.141524 -1.637007
C  1.556427 2.727844 0.725754
C  1.889838 4.497907 -1.388974
C  1.716088 4.079496 0.983378
C  1.867352 4.948984 -0.081465
C  -0.112016 -1.419098 -3.055144
C  0.964947 7.057348 0.371312
H  -0.559759 -5.305808 1.787656
H  -0.544577 -3.954471 2.914747
H  3.007972 -1.703224 1.869544
H  2.941429 -2.634477 0.359133
H  -3.394746 -5.115129 2.040183
H  -2.653448 -0.90833 -0.527993
H  -4.943075 -1.812086 -0.237117
H  0.338395 -6.247118 -1.937535
H  -0.569028 -5.058785 -2.894808
H  1.189753 -4.886122 -2.711558
H  1.818376 2.779677 -2.655304
H  1.404903 2.044753 1.55207
H  2.029019 5.191309 -2.207521
H  1.722188 4.437186 2.003774
H  0.334876 -2.374229 -3.313358
H  -1.042012 -1.585645 -2.511591
H  -0.314578 -0.860619 -3.967986
elementType: Cl F O N C H
totalener: -2299.37910477 hartree
nucrepener: 4204.86971744 hartree
electener: -6504.24882222 hartree
twoeener: 5019.15012397 hartree
cpcmener: -0.05720938 hartree
kineticenergy: 2291.69039814 hartree
xcener: -187.207841239701 hartree
chargesum: 0.0000000
charge: -0.086890 -0.165032 -0.174836 -0.173277 -0.358454 -0.267852 -0.442646 -0.483823 -0.292750 -0.476584 -0.310848 -0.255487 0.065434 -0.027939 0.490266 -0.116282 0.168368 -0.109878 -0.076505 0.317343 0.037181 -0.158917 -0.229966 0.133299 -0.133899 0.328992 -0.164367 0.094186 0.498689 -0.216453 -0.195994 -0.125848 -0.113173 0.202452 -0.142600 0.591336 0.120699 0.107108 0.137258 0.137265 0.141533 0.150500 0.143729 0.137936 0.132974 0.129315 0.162823 0.160542 0.159051 0.158233 0.134664 0.120957 0.138169
qa: -0.0869 -0.1650 -0.1748 -0.1733 -0.3585 -0.2679 -0.4426 -0.4838 -0.2927 -0.4766 -0.3108 -0.2555 0.0654 -0.0279 0.4903 -0.1163 0.1684 -0.1099 -0.0765 0.3173 0.0372 -0.1589 -0.2300 0.1333 -0.1339 0.3290 -0.1644 0.0942 0.4987 -0.2165 -0.1960 -0.1258 -0.1132 0.2025 -0.1426 0.5913 0.1207 0.1071 0.1373 0.1373 0.1415 0.1505 0.1437 0.1379 0.1330 0.1293 0.1628 0.1605 0.1591 0.1582 0.1347 0.1210 0.1382
va: 1.2183 1.1413 1.1251 1.1267 2.0504 2.1727 2.0679 2.0252 2.1062 2.0259 2.0805 2.9171 3.0894 3.0213 3.8562 3.9316 3.7743 3.9428 3.5980 4.1890 3.9700 4.0412 4.0186 3.8316 4.0063 4.3162 3.8567 3.6743 4.2684 4.0267 4.0137 4.0142 3.9914 3.7376 3.8475 4.6113 1.0040 1.0202 0.9917 0.9934 1.0133 1.0189 1.0088 0.9932 0.9910 0.9877 1.0006 1.0008 0.9976 1.0017 0.9918 0.9870 0.9982
dispcorr: -0.032869965 hartree
energy: -2299.411974738260
dipole: 7.04874 -8.46863 -1.41989 -41.05498 37.82956 -3.22543 -12.63987 11.81326 -0.82662
magnitude: 3.61977 au
magnitude: 9.20073 debye
