program: Orca
programVersion: 5.0.2
elementType: Cl F F F O O O O O O O N N N C C C C C C C C C C C C C C C C C C C C C C H H H H H H H H H H H H H H H H H
charge: 0
multiplicity: 1
keywords: wb97x-d3
keywords: def2-TZVPP
keywords: def2/J RIJCOSX
keywords: DEFGRID2
keywords: scfconv7
keywords: smallprint printgap noloewdin
keywords: NOSOSCF
formula: C22H17ClF3N3O7
InChI: InChI=1/C22H17ClF3N3O7/c1-33-18(30)21-10-12-9-13(23)3-8-16(12)17(21)27-28(11-35-21)19(31)29(20(32)34-2)14-4-6-15(7-5-14)36-22(24,25)26/h3-9H,10-11H2,1-2H3
53 atoms
Cl -5.69858 -4.349199 2.06418
F  0.50303 6.961046 -0.903104
F  1.79291 8.190781 0.306953
F  0.543016 6.692226 1.219481
O  1.648578 -3.417692 1.360205
O  -0.376916 -3.888706 -1.511165
O  1.760328 -4.461914 -1.169186
O  3.377116 -0.02966 -0.158112
O  -0.587132 1.193062 -1.884457
O  0.34026 -0.828032 -2.179574
O  2.344689 6.129359 0.034641
N  0.214637 -1.184321 0.627359
N  1.562813 -1.239245 0.405321
N  1.316191 0.727551 -0.822049
C  0.445977 -3.606196 0.663973
C  -0.472952 -4.640539 1.350638
C  -0.337493 -2.325079 0.729525
C  -1.81693 -3.966675 1.360756
C  -1.719349 -2.614548 1.038141
C  0.707313 -4.027767 -0.782061
C  2.414058 -2.323333 0.92556
C  -3.041848 -4.521286 1.683541
C  -2.832632 -1.785521 1.039652
C  -4.150201 -3.685907 1.673173
C  -4.062934 -2.33189 1.35788
C  2.172882 -0.188555 -0.187654
C  -0.3136 -4.287418 -2.886703
C  1.569184 2.11152 -0.61651
C  0.330689 0.27207 -1.68094
C  1.564965 2.611898 0.677855
C  1.83923 2.947905 -1.69119
C  1.823417 3.953878 0.905275
C  2.067594 4.296492 -1.474351
C  2.056549 4.781684 -0.178259
C  -1.626236 0.875043 -2.815792
C  1.305064 6.970173 0.160752
H  -0.484598 -5.611518 0.855312
H  -0.12122 -4.803272 2.372026
H  2.968315 -1.971933 1.796489
H  3.121578 -2.605465 0.143167
H  -3.134271 -5.569008 1.937101
H  -2.751617 -0.736721 0.78657
H  -4.950001 -1.713873 1.357175
H  -1.288889 -4.060482 -3.305167
H  0.451748 -3.729214 -3.423506
H  -0.120541 -5.355609 -2.973241
H  1.355987 1.958382 1.515203
H  1.871866 2.554647 -2.698761
H  1.841749 4.338538 1.91577
H  2.27736 4.954619 -2.30673
H  -1.220764 0.654736 -3.80228
H  -2.222493 0.034144 -2.464348
H  -2.250231 1.761462 -2.872608
elementType: Cl F O N C H
totalener: -2299.37745037 hartree
nucrepener: 4203.45451994 hartree
electener: -6502.83197032 hartree
twoeener: 5019.26608768 hartree
cpcmener: -0.05405170 hartree
kineticenergy: 2291.68549000 hartree
xcener: -187.203172448276 hartree
chargesum: -0.0000000
charge: -0.084257 -0.172902 -0.165052 -0.173832 -0.365104 -0.268272 -0.439459 -0.490794 -0.290674 -0.489423 -0.311136 -0.255569 0.050848 -0.035519 0.516150 -0.120824 0.188785 -0.093567 -0.127318 0.302943 0.053224 -0.162567 -0.224113 0.141599 -0.136446 0.353927 -0.149233 0.078963 0.523134 -0.199520 -0.226595 -0.107196 -0.115706 0.202575 -0.128003 0.591538 0.121684 0.107420 0.137150 0.125448 0.140585 0.154460 0.144885 0.131659 0.122285 0.130828 0.158558 0.161078 0.158730 0.159312 0.123512 0.122082 0.129715
qa: -0.0843 -0.1729 -0.1651 -0.1738 -0.3651 -0.2683 -0.4395 -0.4908 -0.2907 -0.4894 -0.3111 -0.2556 0.0508 -0.0355 0.5162 -0.1208 0.1888 -0.0936 -0.1273 0.3029 0.0532 -0.1626 -0.2241 0.1416 -0.1364 0.3539 -0.1492 0.0790 0.5231 -0.1995 -0.2266 -0.1072 -0.1157 0.2026 -0.1280 0.5915 0.1217 0.1074 0.1371 0.1254 0.1406 0.1545 0.1449 0.1317 0.1223 0.1308 0.1586 0.1611 0.1587 0.1593 0.1235 0.1221 0.1297
va: 1.2214 1.1275 1.1413 1.1263 2.0375 2.1628 2.0648 2.0172 2.1248 2.0174 2.0796 2.8947 3.1121 3.0411 3.8407 3.9587 3.7864 3.9446 3.6545 4.2012 3.9620 4.0426 4.0363 3.8296 3.9916 4.2867 3.8607 3.6392 4.2157 4.0395 4.0483 3.9815 3.9953 3.7424 3.8569 4.6114 1.0042 1.0217 0.9905 0.9935 1.0136 1.0086 1.0084 0.9935 0.9936 0.9919 1.0046 1.0023 1.0005 0.9975 0.9944 0.9895 0.9952
dispcorr: -0.031638786 hartree
energy: -2299.409089157617
dipole: 0.75462 -3.58305 -2.82843 -33.02843 32.13588 -0.89255 -13.98845 13.58935 -0.39911
magnitude: 2.99265 au
magnitude: 7.60671 debye
