program: Orca
programVersion: 5.0.2
elementType: Cl F F F O O O O O O O N N N C C C C C C C C C C C C C C C C C C C C C C H H H H H H H H H H H H H H H H H
charge: 0
multiplicity: 1
keywords: wb97x-d3
keywords: def2-TZVPP
keywords: def2/J RIJCOSX
keywords: DEFGRID2
keywords: scfconv7
keywords: smallprint printgap noloewdin
keywords: NOSOSCF
formula: C22H17ClF3N3O7
InChI: InChI=1/C22H17ClF3N3O7/c1-33-18(30)21-10-12-9-13(23)3-8-16(12)17(21)27-28(11-35-21)19(31)29(20(32)34-2)14-4-6-15(7-5-14)36-22(24,25)26/h3-9H,10-11H2,1-2H3
53 atoms
Cl -5.406286 0.956899 -1.278264
F  -2.502472 1.714401 1.812479
F  -2.449203 3.354591 0.435072
F  -3.109808 3.681175 2.456829
O  0.610524 -3.009422 0.876424
O  -0.174134 -4.904695 -0.771795
O  -0.923579 -3.434319 -2.279255
O  4.303789 -1.535957 0.561859
O  5.291323 0.471347 -0.959319
O  4.692291 2.335814 0.124814
O  -1.01521 3.338381 2.139287
N  1.152179 -0.786276 -0.633739
N  2.143679 -1.507262 -0.060406
N  3.332543 0.504711 0.129473
C  -0.349139 -2.656097 -0.075723
C  -1.75074 -2.406904 0.52343
C  -0.000927 -1.312801 -0.669562
C  -2.270059 -1.266498 -0.311859
C  -1.237791 -0.622603 -0.994366
C  -0.502274 -3.701896 -1.184799
C  1.909329 -2.883154 0.355233
C  -3.565455 -0.793553 -0.391708
C  -1.474902 0.513189 -1.752183
C  -3.79434 0.3382 -1.1635
C  -2.77135 0.994795 -1.839315
C  3.333109 -0.898414 0.223438
C  -0.317474 -5.982403 -1.703098
C  2.248393 1.263702 0.659733
C  4.494827 1.194778 -0.204575
C  1.680337 2.279216 -0.098501
C  1.743379 0.963436 1.914325
C  0.592183 2.981541 0.38467
C  0.629155 1.638414 2.390509
C  0.066067 2.636192 1.619608
C  6.548621 1.0496 -1.314561
C  -2.241835 3.018112 1.710331
H  -2.39348 -3.287757 0.511495
H  -1.639184 -2.093403 1.565216
H  2.605889 -3.145355 1.1467
H  2.075343 -3.553141 -0.495453
H  -4.374738 -1.281797 0.135497
H  -0.67227 1.01305 -2.278284
H  -2.986154 1.872701 -2.433035
H  0.292152 -5.821596 -2.591089
H  0.028974 -6.87056 -1.183969
H  -1.358769 -6.115671 -1.993681
H  2.067042 2.508649 -1.082555
H  2.199181 0.193532 2.523978
H  0.162544 3.782282 -0.201936
H  0.220801 1.399825 3.363801
H  6.416766 1.946185 -1.919005
H  7.141015 1.286119 -0.431218
H  7.064241 0.293747 -1.899651
elementType: Cl F O N C H
totalener: -2299.38367901 hartree
nucrepener: 4438.90028088 hartree
electener: -6738.28395990 hartree
twoeener: 5254.53855424 hartree
cpcmener: -0.04654573 hartree
kineticenergy: 2291.73002480 hartree
xcener: -187.212875193249 hartree
chargesum: 0.0000000
charge: -0.087567 -0.173774 -0.177037 -0.164427 -0.350062 -0.262307 -0.425163 -0.451161 -0.287074 -0.455429 -0.303889 -0.246623 0.048148 -0.043249 0.444799 -0.068631 0.114379 -0.098504 -0.008426 0.287546 0.061510 -0.170779 -0.275853 0.138090 -0.135462 0.315778 -0.131347 0.157843 0.496716 -0.215059 -0.216112 -0.139977 -0.134523 0.228845 -0.123783 0.598615 0.115799 0.104247 0.128527 0.126712 0.133838 0.151145 0.141272 0.121231 0.130720 0.123880 0.152269 0.151411 0.152585 0.153591 0.118859 0.120758 0.127106
qa: -0.0876 -0.1738 -0.1770 -0.1644 -0.3501 -0.2623 -0.4252 -0.4512 -0.2871 -0.4554 -0.3039 -0.2466 0.0481 -0.0432 0.4448 -0.0686 0.1144 -0.0985 -0.0084 0.2875 0.0615 -0.1708 -0.2759 0.1381 -0.1355 0.3158 -0.1313 0.1578 0.4967 -0.2151 -0.2161 -0.1400 -0.1345 0.2288 -0.1238 0.5986 0.1158 0.1042 0.1285 0.1267 0.1338 0.1511 0.1413 0.1212 0.1307 0.1239 0.1523 0.1514 0.1526 0.1536 0.1189 0.1208 0.1271
va: 1.2165 1.1219 1.1188 1.1446 2.0296 2.1727 2.0893 2.0572 2.1314 2.0571 2.0895 2.9539 3.1060 3.0232 3.8967 3.8728 3.8398 3.8801 3.5290 4.2656 3.9845 4.0481 4.0030 3.8147 3.9311 4.3737 3.8588 3.5770 4.2622 4.0275 3.9921 3.9706 3.9842 3.7069 3.8672 4.5893 1.0072 1.0229 1.0027 0.9907 1.0160 1.0085 1.0082 0.9925 0.9947 0.9923 1.0053 1.0058 1.0048 1.0004 0.9922 0.9919 0.9952
dispcorr: -0.034789657 hartree
energy: -2299.418468669695
dipole: 30.64077 -30.68448 -0.04371 -26.39153 24.08345 -2.30807 -9.48314 9.04413 -0.43901
magnitude: 2.34986 au
magnitude: 5.97287 debye
