program: Orca
programVersion: 5.0.2
elementType: Cl F F F O O O O O O O N N N C C C C C C C C C C C C C C C C C C C C C C H H H H H H H H H H H H H H H H H
charge: 0
multiplicity: 1
keywords: wb97x-d3
keywords: def2-TZVPP
keywords: def2/J RIJCOSX
keywords: DEFGRID2
keywords: scfconv7
keywords: smallprint printgap noloewdin
keywords: NOSOSCF
formula: C22H17ClF3N3O7
InChI: InChI=1/C22H17ClF3N3O7/c1-33-18(30)21-10-12-9-13(23)3-8-16(12)17(21)27-28(11-35-21)19(31)29(20(32)34-2)14-4-6-15(7-5-14)36-22(24,25)26/h3-9H,10-11H2,1-2H3
53 atoms
Cl -5.395732 0.97623 -1.277137
F  -2.50899 1.74521 1.823313
F  -2.449194 3.372645 0.43121
F  -3.108136 3.720661 2.450313
O  0.597629 -3.026896 0.883351
O  -0.121888 -4.898342 -0.808072
O  -1.015574 -3.440106 -2.247308
O  4.287169 -1.539536 0.618093
O  5.270433 0.434876 -0.950317
O  4.68912 2.323406 0.102482
O  -1.015183 3.366185 2.13551
N  1.14766 -0.795169 -0.614175
N  2.134679 -1.515857 -0.032365
N  3.32201 0.4972 0.153045
C  -0.36026 -2.665234 -0.066832
C  -1.759462 -2.404971 0.534688
C  -0.004726 -1.322253 -0.658466
C  -2.27323 -1.263023 -0.302302
C  -1.237989 -0.627929 -0.988051
C  -0.526155 -3.705405 -1.180273
C  1.899324 -2.894326 0.37005
C  -3.565433 -0.781593 -0.382653
C  -1.468031 0.505245 -1.751475
C  -3.787466 0.347623 -1.160305
C  -2.761572 0.994242 -1.840776
C  3.320188 -0.905968 0.262197
C  -0.252121 -5.962119 -1.758063
C  2.241084 1.264755 0.675443
C  4.48241 1.177316 -0.20464
C  1.679114 2.278568 -0.090041
C  1.730852 0.974681 1.930665
C  0.593725 2.989215 0.387066
C  0.61895 1.65801 2.400392
C  0.062718 2.654405 1.622878
C  6.527561 0.99936 -1.326819
C  -2.243774 3.046612 1.709163
H  -2.407777 -3.281712 0.525887
H  -1.643516 -2.089783 1.57529
H  2.592005 -3.163247 1.162515
H  2.070708 -3.555257 -0.485971
H  -4.3775 -1.261968 0.147406
H  -0.662249 0.99692 -2.280287
H  -2.971782 1.86988 -2.439447
H  0.296093 -5.74325 -2.674392
H  0.176741 -6.839394 -1.282058
H  -1.298822 -6.152064 -1.993918
H  2.068642 2.501547 -1.074656
H  2.180932 0.206118 2.546438
H  0.169423 3.788555 -0.205464
H  0.207985 1.426902 3.37443
H  7.118803 1.275086 -0.453673
H  7.045516 0.220025 -1.878579
H  6.394857 1.86913 -1.969954
elementType: Cl F O N C H
totalener: -2299.38369592 hartree
nucrepener: 4437.69181567 hartree
electener: -6737.07551159 hartree
twoeener: 5253.32671930 hartree
cpcmener: -0.04655598 hartree
kineticenergy: 2291.71945442 hartree
xcener: -187.211212857839 hartree
chargesum: -0.0000000
charge: -0.087876 -0.173546 -0.176734 -0.164467 -0.350302 -0.262442 -0.427980 -0.450461 -0.287038 -0.456459 -0.304494 -0.247503 0.050051 -0.042210 0.450506 -0.071891 0.117272 -0.099675 -0.007491 0.291127 0.058485 -0.170231 -0.278627 0.136274 -0.134369 0.313950 -0.131044 0.158564 0.496198 -0.216846 -0.216100 -0.139774 -0.133864 0.228088 -0.123798 0.598843 0.116504 0.104471 0.128092 0.128432 0.133835 0.151121 0.141372 0.120854 0.130281 0.124707 0.152180 0.151475 0.152657 0.153642 0.119816 0.126801 0.119624
qa: -0.0879 -0.1735 -0.1767 -0.1645 -0.3503 -0.2624 -0.4280 -0.4505 -0.2870 -0.4565 -0.3045 -0.2475 0.0501 -0.0422 0.4505 -0.0719 0.1173 -0.0997 -0.0075 0.2911 0.0585 -0.1702 -0.2786 0.1363 -0.1344 0.3140 -0.1310 0.1586 0.4962 -0.2168 -0.2161 -0.1398 -0.1339 0.2281 -0.1238 0.5988 0.1165 0.1045 0.1281 0.1284 0.1338 0.1511 0.1414 0.1209 0.1303 0.1247 0.1522 0.1515 0.1527 0.1536 0.1198 0.1268 0.1196
va: 1.2161 1.1224 1.1194 1.1445 2.0301 2.1713 2.0877 2.0582 2.1310 2.0564 2.0889 2.9541 3.1049 3.0229 3.8865 3.8760 3.8367 3.8794 3.5271 4.2571 3.9832 4.0473 4.0036 3.8150 3.9302 4.3749 3.8582 3.5805 4.2624 4.0260 3.9896 3.9717 3.9849 3.7089 3.8677 4.5888 1.0062 1.0228 1.0032 0.9910 1.0159 1.0087 1.0081 0.9928 0.9947 0.9920 1.0057 1.0057 1.0046 1.0004 0.9923 0.9953 0.9917
dispcorr: -0.034708385 hartree
energy: -2299.418404300763
dipole: 30.78045 -30.76240 0.01805 -26.58772 24.24840 -2.33933 -9.68233 9.18561 -0.49672
magnitude: 2.39155 au
magnitude: 6.07884 debye
