program: Orca
programVersion: 5.0.2
elementType: Cl F F F O O O O O O O N N N C C C C C C C C C C C C C C C C C C C C C C H H H H H H H H H H H H H H H H H
charge: 0
multiplicity: 1
keywords: wb97x-d3
keywords: def2-TZVPP
keywords: def2/J RIJCOSX
keywords: DEFGRID2
keywords: scfconv7
keywords: smallprint printgap noloewdin
keywords: NOSOSCF
formula: C22H17ClF3N3O7
InChI: InChI=1/C22H17ClF3N3O7/c1-33-18(30)21-10-12-9-13(23)3-8-16(12)17(21)27-28(11-35-21)19(31)29(20(32)34-2)14-4-6-15(7-5-14)36-22(24,25)26/h3-9H,10-11H2,1-2H3
53 atoms
Cl -5.390781 1.200636 -1.083529
F  -2.943228 3.207869 2.998248
F  -2.312552 1.349025 2.11106
F  -2.349058 3.13751 0.931472
O  0.556601 -3.149912 0.437711
O  -0.302498 -4.807677 -1.419717
O  -1.04323 -3.144723 -2.71599
O  4.298572 -1.737445 0.148688
O  4.684198 2.167798 0.219845
O  5.338582 0.509435 -1.133732
O  -0.849712 2.965041 2.566763
N  1.123541 -0.762178 -0.781361
N  2.1071 -1.571253 -0.325976
N  3.379577 0.365749 0.044801
C  -0.410217 -2.659385 -0.444555
C  -1.796678 -2.456144 0.207384
C  -0.040082 -1.258717 -0.868059
C  -2.301258 -1.206613 -0.466324
C  -1.263951 -0.506249 -1.081546
C  -0.60778 -3.555313 -1.672324
C  1.849511 -2.984643 -0.087339
C  -3.584338 -0.694306 -0.459173
C  -1.481389 0.722711 -1.683119
C  -3.794621 0.531577 -1.077526
C  -2.76552 1.242931 -1.684657
C  3.331455 -1.037815 -0.042821
C  -0.493869 -5.756473 -2.474599
C  2.344212 1.083296 0.713443
C  4.557637 0.988894 -0.354991
C  1.905035 0.651914 1.954779
C  1.741398 2.175031 0.100967
C  0.820555 1.26981 2.560087
C  0.683079 2.818786 0.714779
C  0.216763 2.339463 1.929428
C  5.806567 2.960203 -0.173378
C  -2.086608 2.661995 2.150522
H  -2.460886 -3.313652 0.096858
H  -1.660274 -2.279189 1.27797
H  2.552836 -3.360898 0.650464
H  1.985517 -3.542417 -1.020279
H  -4.39795 -1.223461 0.019532
H  -0.673449 1.265326 -2.155954
H  -2.965538 2.194862 -2.157271
H  -1.546397 -5.836519 -2.744368
H  0.090583 -5.493027 -3.355412
H  -0.147906 -6.708474 -2.083565
H  2.388013 -0.178977 2.453535
H  2.075304 2.509745 -0.872285
H  0.462312 0.925336 3.521258
H  0.225591 3.676098 0.239606
H  6.746016 2.47275 0.085898
H  5.787717 3.174972 -1.241615
H  5.718733 3.889764 0.38156
elementType: Cl F O N C H
totalener: -2299.38368302 hartree
nucrepener: 4444.59156494 hartree
electener: -6743.97524796 hartree
twoeener: 5259.97061518 hartree
cpcmener: -0.04969857 hartree
kineticenergy: 2291.71978517 hartree
xcener: -187.211017728309 hartree
chargesum: 0.0000000
charge: -0.088065 -0.164198 -0.174033 -0.175933 -0.350472 -0.262346 -0.426035 -0.447203 -0.281130 -0.451742 -0.304468 -0.245291 0.054984 -0.047047 0.448441 -0.068207 0.114490 -0.103675 -0.006292 0.286227 0.057381 -0.168973 -0.278728 0.136902 -0.133988 0.328411 -0.131588 0.164477 0.488335 -0.228869 -0.229232 -0.125758 -0.131936 0.219884 -0.127825 0.599692 0.115999 0.103920 0.128806 0.127298 0.134362 0.151330 0.141493 0.123999 0.121308 0.130408 0.151803 0.148990 0.153413 0.152478 0.122833 0.119815 0.125554
qa: -0.0881 -0.1642 -0.1740 -0.1759 -0.3505 -0.2623 -0.4260 -0.4472 -0.2811 -0.4517 -0.3045 -0.2453 0.0550 -0.0470 0.4484 -0.0682 0.1145 -0.1037 -0.0063 0.2862 0.0574 -0.1690 -0.2787 0.1369 -0.1340 0.3284 -0.1316 0.1645 0.4883 -0.2289 -0.2292 -0.1258 -0.1319 0.2199 -0.1278 0.5997 0.1160 0.1039 0.1288 0.1273 0.1344 0.1513 0.1415 0.1240 0.1213 0.1304 0.1518 0.1490 0.1534 0.1525 0.1228 0.1198 0.1256
va: 1.2157 1.1452 1.1217 1.1195 2.0306 2.1730 2.0884 2.0644 2.1234 2.0598 2.0879 2.9548 3.1008 3.0360 3.8926 3.8704 3.8421 3.8756 3.5286 4.2639 3.9888 4.0471 4.0059 3.8163 3.9326 4.3416 3.8589 3.5753 4.2725 4.0046 4.0258 3.9782 3.9497 3.7169 3.8623 4.5864 1.0071 1.0231 1.0007 0.9910 1.0158 1.0080 1.0080 0.9920 0.9926 0.9947 1.0055 1.0081 1.0000 1.0042 0.9918 0.9929 0.9955
dispcorr: -0.034894407 hartree
energy: -2299.418577431869
dipole: 27.67832 -28.43673 -0.75841 -20.00084 19.49351 -0.50734 -10.59206 11.09776 0.50570
magnitude: 1.04322 au
magnitude: 2.65166 debye
