program: Orca
programVersion: 5.0.2
elementType: Cl F F F O O O O O O O N N N C C C C C C C C C C C C C C C C C C C C C C H H H H H H H H H H H H H H H H H
charge: 0
multiplicity: 1
keywords: wb97x-d3
keywords: def2-TZVPP
keywords: def2/J RIJCOSX
keywords: DEFGRID2
keywords: scfconv7
keywords: smallprint printgap noloewdin
keywords: NOSOSCF
formula: C22H17ClF3N3O7
InChI: InChI=1/C22H17ClF3N3O7/c1-33-18(30)21-10-12-9-13(23)3-8-16(12)17(21)27-28(11-35-21)19(31)29(20(32)34-2)14-4-6-15(7-5-14)36-22(24,25)26/h3-9H,10-11H2,1-2H3
53 atoms
Cl -4.338318 -4.151227 4.244823
F  -0.362468 6.807407 -0.886568
F  0.389191 7.936622 -2.560531
F  1.737874 7.196614 -1.054106
O  1.394921 -3.643232 -0.631268
O  -1.163329 -3.052559 -2.226085
O  -1.097636 -5.232575 -1.748925
O  2.916784 -0.055695 -1.709877
O  2.084247 -0.230983 1.826579
O  0.794978 1.604208 1.952244
O  0.778989 5.821801 -2.520353
N  0.246179 -1.257965 0.101717
N  1.334199 -1.288776 -0.692595
N  1.703306 0.934879 -0.034803
C  0.037118 -3.67971 -0.274968
C  -0.257717 -4.62386 0.898826
C  -0.381663 -2.343909 0.27455
C  -1.40421 -3.925253 1.589416
C  -1.441969 -2.575086 1.239225
C  -0.818203 -4.099173 -1.48802
C  1.745746 -2.507918 -1.377073
C  -2.296624 -4.429596 2.515683
C  -2.34233 -1.701251 1.825831
C  -3.209984 -3.551419 3.08609
C  -3.237677 -2.199843 2.75695
C  2.068334 -0.141005 -0.860164
C  -1.909985 -3.320782 -3.412084
C  1.475756 2.192042 -0.664055
C  1.444476 0.819111 1.324011
C  0.17516 2.597644 -0.923336
C  2.545172 2.993218 -1.028898
C  -0.061465 3.818906 -1.529136
C  2.316648 4.215113 -1.641084
C  1.014296 4.618228 -1.875909
C  1.733546 -0.602753 3.151235
C  0.640075 6.917869 -1.757815
H  -0.476172 -5.642448 0.583078
H  0.613544 -4.651523 1.559092
H  2.829006 -2.507323 -1.467788
H  1.315128 -2.529307 -2.382975
H  -2.286964 -5.47286 2.80158
H  -2.348633 -0.652133 1.561827
H  -3.95956 -1.547726 3.228205
H  -2.09523 -2.354861 -3.871969
H  -1.350097 -3.954512 -4.099282
H  -2.857908 -3.804745 -3.179414
H  -0.65076 1.958258 -0.643921
H  3.555193 2.661603 -0.834957
H  -1.071522 4.142232 -1.740043
H  3.145104 4.84263 -1.939084
H  1.948169 0.192827 3.864086
H  0.677517 -0.868236 3.220555
H  2.339568 -1.473485 3.385939
totalener: -2299.35531505 hartree
nucrepener: 4179.40501857 hartree
electener: -6478.76033362 hartree
twoeener: 4993.65772923 hartree
kineticenergy: 2291.80735166 hartree
xcener: -187.215223753910 hartree
chargesum: -0.0000000
charge: -0.063505 -0.167762 -0.155718 -0.168437 -0.313246 -0.253303 -0.328856 -0.369330 -0.286767 -0.359885 -0.295997 -0.218249 0.069011 -0.109550 0.441701 -0.095271 0.076602 -0.096790 -0.052967 0.217989 0.028835 -0.129810 -0.243451 0.101725 -0.094922 0.321272 -0.152712 0.138379 0.451113 -0.176652 -0.190139 -0.087220 -0.075450 0.174345 -0.134084 0.575412 0.112096 0.095413 0.121990 0.110766 0.121712 0.141715 0.125169 0.119676 0.116919 0.119890 0.119145 0.122507 0.124080 0.127142 0.125170 0.103639 0.116660
qa: -0.0635 -0.1678 -0.1557 -0.1684 -0.3132 -0.2533 -0.3289 -0.3693 -0.2868 -0.3599 -0.2960 -0.2182 0.0690 -0.1095 0.4417 -0.0953 0.0766 -0.0968 -0.0530 0.2180 0.0288 -0.1298 -0.2435 0.1017 -0.0949 0.3213 -0.1527 0.1384 0.4511 -0.1767 -0.1901 -0.0872 -0.0755 0.1743 -0.1341 0.5754 0.1121 0.0954 0.1220 0.1108 0.1217 0.1417 0.1252 0.1197 0.1169 0.1199 0.1191 0.1225 0.1241 0.1271 0.1252 0.1036 0.1167
va: 1.2434 1.1348 1.1544 1.1347 2.0722 2.1406 2.1810 2.1469 2.0910 2.1565 2.1022 2.9388 3.0957 3.0231 3.9103 3.8414 3.8187 3.8920 3.6263 4.2753 4.0441 4.0393 4.0506 3.9493 3.9820 4.3405 3.8989 3.7135 4.3015 4.1013 4.1296 4.0130 4.0033 3.8636 3.8945 4.6315 1.0256 1.0229 1.0005 0.9934 1.0195 1.0144 1.0140 0.9946 0.9929 0.9937 1.0199 1.0258 1.0107 1.0099 0.9984 0.9895 0.9937
dispcorr: -0.031168848 hartree
energy: -2299.386483899395
dipole: 3.87668 -4.41494 -0.53825 -35.38863 33.89358 -1.49505 -1.50219 1.43661 -0.06558
magnitude: 1.59034 au
magnitude: 4.04233 debye
