program: Orca
programVersion: 5.0.2
elementType: Cl F F F O O O O O O O N N N C C C C C C C C C C C C C C C C C C C C C C H H H H H H H H H H H H H H H H H
charge: 0
multiplicity: 1
keywords: wb97x-d3
keywords: def2-TZVPP
keywords: def2/J RIJCOSX
keywords: DEFGRID2
keywords: scfconv7
keywords: smallprint printgap noloewdin
keywords: NOSOSCF
formula: C22H17ClF3N3O7
InChI: InChI=1/C22H17ClF3N3O7/c1-33-18(30)21-10-12-9-13(23)3-8-16(12)17(21)27-28(11-35-21)19(31)29(20(32)34-2)14-4-6-15(7-5-14)36-22(24,25)26/h3-9H,10-11H2,1-2H3
53 atoms
Cl -4.638353 -2.852075 4.211731
F  -2.304463 3.697268 -1.995045
F  -1.01794 3.575443 -3.703459
F  -1.877019 5.469837 -3.139718
O  0.54009 -3.138643 -1.318909
O  -0.349065 -0.699649 -1.880629
O  -2.406251 -1.449996 -1.42582
O  3.589749 -0.772096 -1.575616
O  3.935952 -0.556619 1.698488
O  3.099095 1.464123 2.228295
O  -0.305663 4.674023 -1.904633
N  1.139158 -1.333106 0.840577
N  1.943592 -1.56979 -0.244635
N  2.810853 0.553291 0.15418
C  -0.480206 -2.618703 -0.519478
C  -1.499902 -3.628187 0.02393
C  0.013598 -1.913576 0.729141
C  -1.949148 -2.976701 1.304717
C  -1.034927 -2.010938 1.72417
C  -1.215509 -1.529192 -1.334635
C  1.834829 -2.874706 -0.844656
C  -3.069719 -3.249191 2.065488
C  -1.204498 -1.322473 2.915902
C  -3.243184 -2.542993 3.247828
C  -2.323779 -1.591031 3.681831
C  2.862093 -0.639507 -0.631068
C  -0.875284 0.381421 -2.646785
C  2.017058 1.613864 -0.350339
C  3.262372 0.565002 1.451842
C  0.848748 1.993133 0.299521
C  2.401392 2.25629 -1.519477
C  0.068134 3.013897 -0.213502
C  1.61073 3.263226 -2.050812
C  0.452495 3.632188 -1.391432
C  4.406573 -0.731758 3.025985
C  -1.356259 4.352994 -2.67096
H  -2.314105 -3.833038 -0.668881
H  -0.992139 -4.572646 0.239118
H  2.112423 -3.61227 -0.080172
H  2.520775 -2.942489 -1.683854
H  -3.798136 -3.985915 1.754956
H  -0.481639 -0.583456 3.235883
H  -2.494536 -1.063898 4.609873
H  -1.418376 0.016044 -3.5183
H  -1.539295 1.004455 -2.050243
H  -0.015496 0.96186 -2.965431
H  0.549343 1.492889 1.208686
H  3.317994 1.965285 -2.013513
H  -0.828748 3.32532 0.303873
H  1.90674 3.772611 -2.957842
H  4.925346 -1.686272 3.033326
H  5.097243 0.059471 3.316031
H  3.583147 -0.761567 3.739731
totalener: -2299.35291978 hartree
nucrepener: 4397.61956203 hartree
electener: -6696.97248182 hartree
twoeener: 5211.68205052 hartree
kineticenergy: 2291.81566366 hartree
xcener: -187.217710630382 hartree
chargesum: -0.0000000
charge: -0.059767 -0.174282 -0.174159 -0.150595 -0.323747 -0.242659 -0.331530 -0.336437 -0.289519 -0.378525 -0.286647 -0.206859 0.085430 -0.085132 0.463562 -0.095816 0.030508 -0.116332 -0.023304 0.226314 0.056390 -0.135642 -0.206492 0.117315 -0.120448 0.252028 -0.155649 0.136953 0.451265 -0.141348 -0.171503 -0.135256 -0.137755 0.197351 -0.133225 0.579492 0.109104 0.092720 0.101808 0.114194 0.119311 0.143821 0.123493 0.130562 0.111159 0.122102 0.111480 0.140180 0.129847 0.129137 0.111811 0.115856 0.109435
qa: -0.0598 -0.1743 -0.1742 -0.1506 -0.3237 -0.2427 -0.3315 -0.3364 -0.2895 -0.3785 -0.2866 -0.2069 0.0854 -0.0851 0.4636 -0.0958 0.0305 -0.1163 -0.0233 0.2263 0.0564 -0.1356 -0.2065 0.1173 -0.1204 0.2520 -0.1556 0.1370 0.4513 -0.1413 -0.1715 -0.1353 -0.1378 0.1974 -0.1332 0.5795 0.1091 0.0927 0.1018 0.1142 0.1193 0.1438 0.1235 0.1306 0.1112 0.1221 0.1115 0.1402 0.1298 0.1291 0.1118 0.1159 0.1094
va: 1.2480 1.1238 1.1221 1.1635 2.0445 2.1840 2.1718 2.1724 2.0975 2.1414 2.1039 2.9472 3.1219 3.0056 3.8201 3.8894 3.9134 3.9733 3.6214 4.3175 4.0048 4.0667 4.0559 3.9487 4.0183 4.3927 3.8913 3.7173 4.2926 4.0233 4.0654 3.9917 4.0071 3.8063 3.9091 4.6151 1.0202 1.0170 0.9888 1.0126 1.0201 1.0140 1.0165 1.0006 1.0020 0.9899 1.0253 1.0270 1.0110 1.0111 0.9951 0.9947 0.9936
dispcorr: -0.035680216 hartree
energy: -2299.388599997627
dipole: 21.20844 -21.02274 0.18570 -18.04785 16.72478 -1.32307 7.49993 -6.88950 0.61044
magnitude: 1.46889 au
magnitude: 3.73361 debye
