program: Orca
programVersion: 5.0.2
elementType: Cl F F F O O O O O O O N N N C C C C C C C C C C C C C C C C C C C C C C H H H H H H H H H H H H H H H H H
charge: 0
multiplicity: 1
keywords: wb97x-d3
keywords: def2-TZVPP
keywords: def2/J RIJCOSX
keywords: DEFGRID2
keywords: scfconv7
keywords: smallprint printgap noloewdin
keywords: NOSOSCF
formula: C22H17ClF3N3O7
InChI: InChI=1/C22H17ClF3N3O7/c1-33-18(30)21-10-12-9-13(23)3-8-16(12)17(21)27-28(11-35-21)19(31)29(20(32)34-2)14-4-6-15(7-5-14)36-22(24,25)26/h3-9H,10-11H2,1-2H3
53 atoms
Cl -4.744211 -3.044514 4.039475
F  -1.774211 3.471945 -3.114251
F  -1.575211 5.576363 -3.546756
F  -2.103765 4.927108 -1.570354
O  0.698246 -3.316899 -1.232164
O  -0.257431 -0.912291 -1.888426
O  -2.299597 -1.754734 -1.536665
O  3.6021 -0.827605 -1.501061
O  3.795573 -0.45689 1.810222
O  2.834181 1.541445 2.193979
O  -0.04124 4.649469 -2.366217
N  1.12678 -1.414404 0.886992
N  1.988907 -1.660729 -0.152457
N  2.71913 0.527575 0.150436
C  -0.375939 -2.812009 -0.496497
C  -1.379208 -3.843494 0.035355
C  0.032637 -2.046602 0.747938
C  -1.912686 -3.168449 1.270782
C  -1.056783 -2.153375 1.696922
C  -1.113909 -1.774233 -1.375516
C  1.957378 -2.989463 -0.703179
C  -3.056892 -3.458673 1.988768
C  -1.308639 -1.431331 2.853706
C  -3.314053 -2.718114 3.134325
C  -2.452299 -1.717008 3.576174
C  2.854072 -0.694407 -0.571915
C  -0.788382 0.140332 -2.690407
C  1.987585 1.56867 -0.475523
C  3.085725 0.617658 1.472326
C  0.765908 1.983395 0.038013
C  2.489354 2.166313 -1.622845
C  0.057127 3.007202 -0.568614
C  1.769896 3.166679 -2.255317
C  0.565158 3.589007 -1.720043
C  4.178426 -0.559183 3.172709
C  -1.352045 4.644656 -2.638268
H  -2.151105 -4.105057 -0.686191
H  -0.844942 -4.758636 0.306148
H  2.219727 -3.68714 0.102929
H  2.68775 -3.06477 -1.503288
H  -3.740933 -4.234451 1.672524
H  -0.630719 -0.652962 3.178635
H  -2.687174 -1.165022 4.475253
H  -1.259845 -0.2533 -3.590609
H  -1.514945 0.733331 -2.137155
H  0.059394 0.76316 -2.959304
H  0.36887 1.516401 0.927769
H  3.441089 1.84647 -2.023151
H  -0.870811 3.339208 -0.126029
H  2.154839 3.638127 -3.149501
H  4.803504 0.278761 3.479806
H  3.308912 -0.61113 3.828271
H  4.74583 -1.482289 3.252976
totalener: -2299.35237849 hartree
nucrepener: 4364.27566654 hartree
electener: -6663.62804504 hartree
twoeener: 5178.34296710 hartree
kineticenergy: 2291.79865006 hartree
xcener: -187.216393799542 hartree
chargesum: 0.0000000
charge: -0.059528 -0.169603 -0.151870 -0.170614 -0.323545 -0.242767 -0.330717 -0.342475 -0.290280 -0.377905 -0.273636 -0.206515 0.083847 -0.083920 0.462562 -0.096217 0.038779 -0.115824 -0.032163 0.226181 0.057375 -0.136219 -0.204423 0.117514 -0.120284 0.258487 -0.158043 0.118937 0.454785 -0.146497 -0.160090 -0.148795 -0.147654 0.209804 -0.133308 0.573576 0.108741 0.092673 0.100990 0.113965 0.119064 0.141923 0.123816 0.130657 0.117355 0.121179 0.113127 0.137527 0.132752 0.129848 0.116325 0.109187 0.111916
qa: -0.0595 -0.1696 -0.1519 -0.1706 -0.3235 -0.2428 -0.3307 -0.3425 -0.2903 -0.3779 -0.2736 -0.2065 0.0838 -0.0839 0.4626 -0.0962 0.0388 -0.1158 -0.0322 0.2262 0.0574 -0.1362 -0.2044 0.1175 -0.1203 0.2585 -0.1580 0.1189 0.4548 -0.1465 -0.1601 -0.1488 -0.1477 0.2098 -0.1333 0.5736 0.1087 0.0927 0.1010 0.1140 0.1191 0.1419 0.1238 0.1307 0.1174 0.1212 0.1131 0.1375 0.1328 0.1298 0.1163 0.1092 0.1119
va: 1.2481 1.1274 1.1581 1.1296 2.0450 2.1844 2.1725 2.1670 2.0966 2.1428 2.1240 2.9484 3.1251 3.0055 3.8196 3.8912 3.9079 3.9684 3.6252 4.3198 4.0068 4.0666 4.0529 3.9473 4.0143 4.3856 3.8891 3.7404 4.2864 4.0321 4.0835 3.9417 3.9974 3.8205 3.9085 4.6263 1.0203 1.0171 0.9889 1.0126 1.0201 1.0155 1.0161 0.9991 0.9967 0.9899 1.0258 1.0288 1.0220 1.0124 0.9949 0.9937 0.9949
dispcorr: -0.034902361 hartree
energy: -2299.387280853381
dipole: 21.65219 -21.44107 0.21113 -19.84698 18.50535 -1.34162 7.09532 -6.47992 0.61540
magnitude: 1.49105 au
magnitude: 3.78996 debye
