program: Orca
programVersion: 5.0.2
elementType: Cl F F F O O O O O O O N N N C C C C C C C C C C C C C C C C C C C C C C H H H H H H H H H H H H H H H H H
charge: 0
multiplicity: 1
keywords: wb97x-d3
keywords: def2-TZVPP
keywords: def2/J RIJCOSX
keywords: DEFGRID2
keywords: scfconv7
keywords: smallprint printgap noloewdin
keywords: NOSOSCF
formula: C22H17ClF3N3O7
InChI: InChI=1/C22H17ClF3N3O7/c1-33-18(30)21-10-12-9-13(23)3-8-16(12)17(21)27-28(11-35-21)19(31)29(20(32)34-2)14-4-6-15(7-5-14)36-22(24,25)26/h3-9H,10-11H2,1-2H3
53 atoms
Cl -4.615839 -3.099595 4.232725
F  -1.704611 3.493226 -3.191507
F  -1.518492 5.600451 -3.61793
F  -2.067397 4.942894 -1.649832
O  0.617769 -3.31123 -1.245936
O  -0.336532 -0.893656 -1.850205
O  -2.374502 -1.7179 -1.436697
O  3.518046 -0.853235 -1.602518
O  3.80215 -0.479665 1.725952
O  2.877855 1.535076 2.111331
O  0.007972 4.684001 -2.417382
N  1.128293 -1.429117 0.874711
N  1.956009 -1.677843 -0.1920
N  2.707723 0.509219 0.078386
C  -0.428342 -2.804585 -0.471714
C  -1.421583 -3.834394 0.081268
C  0.025831 -2.053306 0.7662
C  -1.903606 -3.175016 1.345592
C  -1.030472 -2.1664 1.751517
C  -1.184332 -1.751514 -1.31643
C  1.894257 -3.003155 -0.748483
C  -3.017648 -3.476789 2.104964
C  -1.236708 -1.460091 2.926964
C  -3.227685 -2.753981 3.271048
C  -2.350153 -1.75717 3.690785
C  2.808179 -0.715195 -0.644248
C  -0.882586 0.171796 -2.624911
C  1.995861 1.566736 -0.542875
C  3.101909 0.601953 1.39248
C  2.484476 2.131719 -1.712303
C  0.804647 2.029645 0.000353
C  1.779582 3.146048 -2.339402
C  0.113587 3.068006 -0.60116
C  0.605549 3.614426 -1.776353
C  4.194423 -0.581771 3.085901
C  -1.298985 4.669203 -2.708688
H  -2.22204 -4.077421 -0.615264
H  -0.886945 -4.758797 0.317628
H  2.168561 -3.70784 0.047479
H  2.602401 -3.083539 -1.567729
H  -3.713129 -4.249144 1.805646
H  -0.546619 -0.685706 3.235183
H  -2.548999 -1.21796 4.606148
H  -1.582381 0.768574 -2.041967
H  -0.037352 0.786695 -2.918789
H  -1.38999 -0.20902 -3.511009
H  3.413674 1.776141 -2.134275
H  0.417932 1.588028 0.907323
H  2.153123 3.591626 -3.251519
H  -0.789399 3.439483 -0.138767
H  4.752024 -1.510834 3.165246
H  4.830665 0.250371 3.385557
H  3.329014 -0.6220 3.747773
totalener: -2299.35271261 hartree
nucrepener: 4360.10865072 hartree
electener: -6659.46136333 hartree
twoeener: 5174.19036743 hartree
kineticenergy: 2291.80248821 hartree
xcener: -187.217099643712 hartree
chargesum: 0.0000000
charge: -0.059655 -0.169769 -0.151783 -0.171369 -0.323110 -0.242298 -0.330799 -0.345297 -0.290007 -0.378363 -0.275546 -0.206279 0.083201 -0.081866 0.460600 -0.098129 0.045062 -0.113577 -0.036353 0.226794 0.056836 -0.136715 -0.205094 0.117426 -0.119500 0.260545 -0.156412 0.115583 0.455027 -0.159076 -0.145864 -0.143116 -0.146381 0.203306 -0.132904 0.574234 0.108993 0.092930 0.101162 0.114483 0.118950 0.140686 0.123654 0.116555 0.120727 0.130952 0.138328 0.112760 0.129433 0.133280 0.112094 0.116792 0.108865
qa: -0.0597 -0.1698 -0.1518 -0.1714 -0.3231 -0.2423 -0.3308 -0.3453 -0.2900 -0.3784 -0.2755 -0.2063 0.0832 -0.0819 0.4606 -0.0981 0.0451 -0.1136 -0.0364 0.2268 0.0568 -0.1367 -0.2051 0.1174 -0.1195 0.2605 -0.1564 0.1156 0.4550 -0.1591 -0.1459 -0.1431 -0.1464 0.2033 -0.1329 0.5742 0.1090 0.0929 0.1012 0.1145 0.1190 0.1407 0.1237 0.1166 0.1207 0.1310 0.1383 0.1128 0.1294 0.1333 0.1121 0.1168 0.1089
va: 1.2481 1.1264 1.1584 1.1288 2.0445 2.1842 2.1725 2.1636 2.0977 2.1414 2.1204 2.9481 3.1288 3.0106 3.8204 3.8949 3.9013 3.9674 3.6316 4.3213 4.0072 4.0661 4.0538 3.9467 4.0118 4.3804 3.8887 3.7388 4.2854 4.0781 4.0244 4.0028 3.9497 3.8177 3.9079 4.6244 1.0204 1.0171 0.9889 1.0127 1.0201 1.0158 1.0161 0.9967 0.9906 0.9989 1.0293 1.0268 1.0122 1.0211 0.9949 0.9951 0.9938
dispcorr: -0.034809313 hartree
energy: -2299.387521924793
dipole: 21.06579 -20.84334 0.22245 -19.81658 18.46071 -1.35587 7.07011 -6.42581 0.64430
magnitude: 1.51756 au
magnitude: 3.85733 debye
