program: Orca
programVersion: 5.0.2
elementType: Cl F F F O O O O O O O N N N C C C C C C C C C C C C C C C C C C C C C C H H H H H H H H H H H H H H H H H
charge: 0
multiplicity: 1
keywords: wb97x-d3
keywords: def2-TZVPP
keywords: def2/J RIJCOSX
keywords: DEFGRID2
keywords: scfconv7
keywords: smallprint printgap noloewdin
keywords: NOSOSCF
formula: C22H17ClF3N3O7
InChI: InChI=1/C22H17ClF3N3O7/c1-33-18(30)21-10-12-9-13(23)3-8-16(12)17(21)27-28(11-35-21)19(31)29(20(32)34-2)14-4-6-15(7-5-14)36-22(24,25)26/h3-9H,10-11H2,1-2H3
53 atoms
Cl -4.423617 -3.484042 4.450212
F  -1.744896 5.700166 -3.296418
F  -1.937171 3.610991 -2.805245
F  -0.374829 4.259438 -4.11968
O  0.473657 -3.133582 -1.322297
O  -0.525793 -0.699669 -1.709239
O  -2.536601 -1.563411 -1.246296
O  3.364223 -0.640651 -1.612955
O  3.764483 -0.481345 1.721347
O  2.853368 1.503967 2.263287
O  -0.281159 4.841187 -1.972828
N  1.069609 -1.405182 0.90468
N  1.847539 -1.565286 -0.214812
N  2.60665 0.601951 0.181184
C  -0.538139 -2.699752 -0.462028
C  -1.494025 -3.781454 0.056826
C  -0.02937 -2.037744 0.80549
C  -1.907164 -3.238799 1.39868
C  -1.026509 -2.250093 1.835877
C  -1.341487 -1.596986 -1.1911
C  1.769548 -2.849021 -0.861951
C  -2.963712 -3.631152 2.198196
C  -1.167026 -1.655602 3.081239
C  -3.10893 -3.019693 3.4356
C  -2.222542 -2.043693 3.885543
C  2.685034 -0.571047 -0.62556
C  -1.115312 0.399259 -2.40024
C  1.87899 1.696677 -0.35176
C  3.050279 0.61589 1.482133
C  0.671278 2.082023 0.216948
C  2.36725 2.366004 -1.464975
C  -0.048897 3.129384 -0.330726
C  1.644602 3.408269 -2.024726
C  0.439411 3.776091 -1.453317
C  4.230043 -0.654562 3.050619
C  -1.067712 4.600159 -3.030755
H  -2.332075 -3.971287 -0.61138
H  -0.943202 -4.717786 0.18265
H  2.084006 -3.605333 -0.130816
H  2.440036 -2.864295 -1.715846
H  -3.66296 -4.39128 1.877106
H  -0.469662 -0.898097 3.414205
H  -2.368066 -1.593036 4.857134
H  -0.288743 1.0332 -2.706113
H  -1.665607 0.059923 -3.277452
H  -1.787229 0.960193 -1.753074
H  0.292775 1.56025 1.084217
H  3.3136 2.070339 -1.895022
H  -0.984871 3.442025 0.112301
H  2.033317 3.940108 -2.881904
H  3.403355 -0.712704 3.758665
H  4.775011 -1.594455 3.053978
H  4.897099 0.152934 3.351219
totalener: -2299.35327724 hartree
nucrepener: 4360.97101539 hartree
electener: -6660.32429263 hartree
twoeener: 5175.07656217 hartree
kineticenergy: 2291.80176708 hartree
xcener: -187.214950815570 hartree
chargesum: 0.0000000
charge: -0.059775 -0.151269 -0.173038 -0.172611 -0.322821 -0.242430 -0.331479 -0.344572 -0.290124 -0.377648 -0.287839 -0.209423 0.084744 -0.086037 0.462005 -0.099216 0.048237 -0.111707 -0.036913 0.227076 0.055368 -0.139076 -0.206181 0.118295 -0.119402 0.261266 -0.157658 0.139332 0.455670 -0.165293 -0.178201 -0.143585 -0.097055 0.184783 -0.133047 0.578384 0.109533 0.093194 0.101595 0.114701 0.118777 0.140162 0.123914 0.118152 0.132014 0.117581 0.116426 0.137855 0.131891 0.128177 0.108785 0.111952 0.116528
qa: -0.0598 -0.1513 -0.1730 -0.1726 -0.3228 -0.2424 -0.3315 -0.3446 -0.2901 -0.3776 -0.2878 -0.2094 0.0847 -0.0860 0.4620 -0.0992 0.0482 -0.1117 -0.0369 0.2271 0.0554 -0.1391 -0.2062 0.1183 -0.1194 0.2613 -0.1577 0.1393 0.4557 -0.1653 -0.1782 -0.1436 -0.0971 0.1848 -0.1330 0.5784 0.1095 0.0932 0.1016 0.1147 0.1188 0.1402 0.1239 0.1182 0.1320 0.1176 0.1164 0.1379 0.1319 0.1282 0.1088 0.1120 0.1165
va: 1.2477 1.1621 1.1236 1.1279 2.0437 2.1845 2.1720 2.1648 2.0970 2.1435 2.1040 2.9462 3.1279 3.0024 3.8165 3.8989 3.8935 3.9700 3.6376 4.3218 4.0079 4.0651 4.0541 3.9447 4.0099 4.3806 3.8912 3.7013 4.2862 4.0164 4.0960 3.9733 4.0098 3.8127 3.9094 4.6179 1.0205 1.0171 0.9890 1.0132 1.0202 1.0160 1.0160 0.9917 0.9996 0.9962 1.0237 1.0294 1.0083 1.0140 0.9938 0.9950 0.9948
dispcorr: -0.035029742 hartree
energy: -2299.388306983397
dipole: 18.60483 -18.38045 0.22438 -18.16329 16.80719 -1.35610 9.57753 -8.90003 0.67750
magnitude: 1.53243 au
magnitude: 3.89513 debye
