program: Orca
programVersion: 5.0.2
elementType: Cl F F F O O O O O O O N N N C C C C C C C C C C C C C C C C C C C C C C H H H H H H H H H H H H H H H H H
charge: 0
multiplicity: 1
keywords: wb97x-d3
keywords: def2-TZVPP
keywords: def2/J RIJCOSX
keywords: DEFGRID2
keywords: scfconv7
keywords: smallprint printgap noloewdin
keywords: NOSOSCF
formula: C22H17ClF3N3O7
InChI: InChI=1/C22H17ClF3N3O7/c1-33-18(30)21-10-12-9-13(23)3-8-16(12)17(21)27-28(11-35-21)19(31)29(20(32)34-2)14-4-6-15(7-5-14)36-22(24,25)26/h3-9H,10-11H2,1-2H3
53 atoms
Cl -4.182188 -4.439443 4.378984
F  -0.681627 6.699741 -2.089969
F  0.872587 8.078101 -2.659228
F  0.820378 7.25732 -0.665916
O  1.279351 -3.54658 -0.699954
O  -0.397158 -4.561613 -2.503388
O  -2.108865 -3.404331 -1.64416
O  2.717089 0.066787 -1.732045
O  2.049878 -0.201856 1.831347
O  0.868958 1.693615 2.077067
O  1.411213 6.014105 -2.412155
N  0.158401 -1.218179 0.195383
N  1.191683 -1.19794 -0.67148
N  1.587716 1.017267 0.018177
C  -0.076047 -3.594113 -0.368472
C  -0.406179 -4.674924 0.68397
C  -0.461469 -2.315493 0.33189
C  -1.45126 -4.004605 1.539428
C  -1.453096 -2.624531 1.344701
C  -0.987641 -3.819236 -1.580593
C  1.583201 -2.38782 -1.421205
C  -2.287412 -4.581182 2.474944
C  -2.270265 -1.795376 2.095632
C  -3.11772 -3.745713 3.211241
C  -3.113815 -2.365937 3.034213
C  1.912136 -0.042395 -0.843088
C  -1.165258 -4.865078 -3.665129
C  1.512349 2.312541 -0.561013
C  1.428552 0.8869 1.392787
C  2.412579 3.299864 -0.19154
C  0.551614 2.575667 -1.52501
C  2.350942 4.550149 -0.780146
C  0.497882 3.816847 -2.137581
C  1.400559 4.793635 -1.757035
C  1.772611 -0.588617 3.169057
C  0.613815 6.990272 -1.955044
H  -0.733708 -5.61994 0.248431
H  0.495786 -4.880469 1.267289
H  2.658723 -2.366465 -1.577034
H  1.09445 -2.383168 -2.403796
H  -2.299754 -5.650131 2.641618
H  -2.2588 -0.723893 1.9457
H  -3.773003 -1.746727 3.626223
H  -0.517908 -5.459613 -4.302908
H  -2.058286 -5.437278 -3.414265
H  -1.466588 -3.959463 -4.191185
H  3.171297 3.091068 0.550313
H  -0.158935 1.807443 -1.801173
H  3.058473 5.320392 -0.505194
H  -0.233949 4.016055 -2.908207
H  0.712716 -0.807976 3.305182
H  2.351191 -1.491577 3.343287
H  2.072183 0.179364 3.881657
totalener: -2299.35586873 hartree
nucrepener: 4145.88652034 hartree
electener: -6445.24238907 hartree
twoeener: 4960.42730485 hartree
kineticenergy: 2291.79950268 hartree
xcener: -187.214477996326 hartree
chargesum: 0.0000000
charge: -0.066509 -0.170784 -0.156164 -0.167004 -0.309923 -0.249651 -0.322676 -0.360629 -0.284646 -0.351277 -0.295241 -0.232979 0.058538 -0.085328 0.459786 -0.124032 0.077011 -0.095068 -0.010200 0.188614 0.039696 -0.138500 -0.244880 0.102714 -0.088195 0.278654 -0.135784 0.146337 0.425255 -0.164421 -0.181643 -0.085677 -0.074836 0.174594 -0.134582 0.574393 0.101802 0.099246 0.123093 0.101299 0.116885 0.145046 0.124274 0.123144 0.115990 0.115150 0.119663 0.123720 0.124271 0.125739 0.105132 0.116452 0.124131
qa: -0.0665 -0.1708 -0.1562 -0.1670 -0.3099 -0.2497 -0.3227 -0.3606 -0.2846 -0.3513 -0.2952 -0.2330 0.0585 -0.0853 0.4598 -0.1240 0.0770 -0.0951 -0.0102 0.1886 0.0397 -0.1385 -0.2449 0.1027 -0.0882 0.2787 -0.1358 0.1463 0.4253 -0.1644 -0.1816 -0.0857 -0.0748 0.1746 -0.1346 0.5744 0.1018 0.0992 0.1231 0.1013 0.1169 0.1450 0.1243 0.1231 0.1160 0.1151 0.1197 0.1237 0.1243 0.1257 0.1051 0.1165 0.1241
va: 1.2406 1.1319 1.1536 1.1357 2.0721 2.1596 2.1849 2.1481 2.0895 2.1606 2.1032 2.9603 3.1057 3.0160 3.8712 3.8840 3.9196 3.9044 3.6660 4.3262 4.0391 4.0485 4.0334 3.9572 3.9739 4.3469 3.8862 3.7174 4.3249 4.1219 4.1026 4.0299 4.0121 3.8654 3.8934 4.6336 1.0087 1.0196 1.0005 0.9967 1.0210 1.0159 1.0133 0.9944 0.9943 0.9936 1.0127 1.0127 1.0096 1.0115 0.9906 0.9938 0.9984
dispcorr: -0.030671954 hartree
energy: -2299.386540687735
dipole: 6.80051 -6.73163 0.06888 -39.15745 36.59090 -2.56656 -1.08400 0.97354 -0.11045
magnitude: 2.56985 au
magnitude: 6.53205 debye
