program: Orca
programVersion: 5.0.2
elementType: Cl F F F O O O O O O O N N N C C C C C C C C C C C C C C C C C C C C C C H H H H H H H H H H H H H H H H H
charge: 0
multiplicity: 1
keywords: wb97x-d3
keywords: def2-TZVPP
keywords: def2/J RIJCOSX
keywords: DEFGRID2
keywords: scfconv7
keywords: smallprint printgap noloewdin
keywords: NOSOSCF
formula: C22H17ClF3N3O7
InChI: InChI=1/C22H17ClF3N3O7/c1-33-18(30)21-10-12-9-13(23)3-8-16(12)17(21)27-28(11-35-21)19(31)29(20(32)34-2)14-4-6-15(7-5-14)36-22(24,25)26/h3-9H,10-11H2,1-2H3
53 atoms
Cl -5.861753 -4.426544 1.552086
F  2.029592 7.175101 -1.455863
F  1.661247 8.43177 0.253833
F  0.113794 7.134606 -0.496937
O  1.498883 -3.175165 1.681652
O  -0.152976 -4.354543 -1.229412
O  1.913502 -4.801847 -0.497343
O  3.229728 0.191934 0.257855
O  0.604081 -0.600679 -2.130896
O  -0.598956 1.284422 -1.933185
O  1.87357 6.319061 0.59283
N  0.08062 -1.197082 0.449193
N  1.428352 -1.127234 0.49185
N  1.244561 0.926931 -0.630785
C  0.396077 -3.567917 0.921014
C  -0.577316 -4.468184 1.71591
C  -0.428663 -2.345393 0.622443
C  -1.935289 -3.919612 1.362578
C  -1.834448 -2.666625 0.762351
C  0.836329 -4.304936 -0.348291
C  2.274293 -2.191059 1.066364
C  -3.17347 -4.476904 1.615856
C  -2.964481 -1.940006 0.420812
C  -4.301727 -3.750985 1.256086
C  -4.209331 -2.493701 0.666691
C  2.059084 0.001287 0.044516
C  0.087444 -5.086185 -2.428406
C  1.411971 2.309065 -0.323335
C  0.307139 0.579669 -1.592933
C  0.424392 2.973002 0.388921
C  2.553434 2.982702 -0.730352
C  0.563822 4.320019 0.676823
C  2.70509 4.327467 -0.433443
C  1.704109 4.984491 0.259045
C  -0.374532 -1.160715 -2.992699
C  1.423045 7.242407 -0.269976
H  -0.466574 -5.53108 1.496264
H  -0.375057 -4.33686 2.782129
H  2.904693 -1.760069 1.842181
H  2.916929 -2.600587 0.281134
H  -3.273492 -5.447051 2.084156
H  -2.876663 -0.962246 -0.035183
H  -5.109967 -1.957224 0.403059
H  0.324072 -6.129181 -2.218924
H  -0.833815 -5.030253 -3.00066
H  0.905376 -4.650425 -3.00224
H  -0.456036 2.436295 0.713179
H  3.324755 2.459075 -1.275857
H  -0.200116 4.843346 1.234994
H  3.598935 4.856397 -0.733868
H  -0.605609 -0.498995 -3.826559
H  0.05658 -2.083441 -3.371028
H  -1.294086 -1.390641 -2.4527
totalener: -2299.35562582 hartree
nucrepener: 4182.99581441 hartree
electener: -6482.35144023 hartree
twoeener: 4997.19153375 hartree
kineticenergy: 2291.79147774 hartree
xcener: -187.214059756991 hartree
chargesum: 0.0000000
charge: -0.063892 -0.169168 -0.156131 -0.168291 -0.313338 -0.265770 -0.317105 -0.378230 -0.288019 -0.363269 -0.295239 -0.228660 0.045533 -0.099750 0.520458 -0.192701 0.102754 -0.089543 -0.053304 0.212449 0.029329 -0.142883 -0.216509 0.115390 -0.116114 0.327860 -0.171054 0.137618 0.447429 -0.180739 -0.180302 -0.085193 -0.080905 0.173171 -0.140790 0.574931 0.107146 0.104534 0.125597 0.125633 0.118337 0.146133 0.124644 0.126880 0.126645 0.117583 0.122148 0.122882 0.124695 0.126611 0.135962 0.108547 0.105999
qa: -0.0639 -0.1692 -0.1561 -0.1683 -0.3133 -0.2658 -0.3171 -0.3782 -0.2880 -0.3633 -0.2952 -0.2287 0.0455 -0.0997 0.5205 -0.1927 0.1028 -0.0895 -0.0533 0.2124 0.0293 -0.1429 -0.2165 0.1154 -0.1161 0.3279 -0.1711 0.1376 0.4474 -0.1807 -0.1803 -0.0852 -0.0809 0.1732 -0.1408 0.5749 0.1071 0.1045 0.1256 0.1256 0.1183 0.1461 0.1246 0.1269 0.1266 0.1176 0.1221 0.1229 0.1247 0.1266 0.1360 0.1085 0.1060
va: 1.2432 1.1334 1.1537 1.1342 2.0929 2.1384 2.1900 2.1391 2.0852 2.1492 2.1027 2.9109 3.0747 3.0456 3.8135 3.9559 3.8335 3.9193 3.6810 4.2528 3.9988 4.0517 4.0441 3.9425 4.0146 4.3411 3.8946 3.7112 4.2986 4.1090 4.1035 4.0145 4.0125 3.8660 3.8925 4.6326 1.0040 1.0203 0.9960 0.9964 1.0210 1.0174 1.0155 0.9978 0.9889 0.9891 1.0225 1.0287 1.0103 1.0101 1.0009 0.9931 0.9907
dispcorr: -0.032198040 hartree
energy: -2299.387823858079
dipole: 3.13957 -4.12384 -0.98427 -41.12856 38.76414 -2.36442 -9.02339 8.57982 -0.44357
magnitude: 2.59924 au
magnitude: 6.60673 debye
