program: Orca
programVersion: 5.0.2
elementType: Cl F F F O O O O O O O N N N C C C C C C C C C C C C C C C C C C C C C C H H H H H H H H H H H H H H H H H
charge: 0
multiplicity: 1
keywords: wb97x-d3
keywords: def2-TZVPP
keywords: def2/J RIJCOSX
keywords: DEFGRID2
keywords: scfconv7
keywords: smallprint printgap noloewdin
keywords: NOSOSCF
formula: C22H17ClF3N3O7
InChI: InChI=1/C22H17ClF3N3O7/c1-33-18(30)21-10-12-9-13(23)3-8-16(12)17(21)27-28(11-35-21)19(31)29(20(32)34-2)14-4-6-15(7-5-14)36-22(24,25)26/h3-9H,10-11H2,1-2H3
53 atoms
Cl -5.402754 0.744997 -1.144615
F  -2.438277 3.477207 0.084842
F  -3.11519 3.940956 2.074059
F  -2.52407 1.928696 1.565457
O  0.651842 -2.983181 1.253601
O  -1.138048 -3.64428 -1.744979
O  0.130839 -5.001563 -0.500474
O  4.280671 -1.435428 0.937068
O  5.283232 0.275966 -0.916718
O  4.671389 2.308045 -0.197297
O  -1.022028 3.552948 1.801178
N  1.166171 -0.911206 -0.463737
N  2.166437 -1.551761 0.177775
N  3.317546 0.496692 0.131449
C  -0.302273 -2.748184 0.266482
C  -1.706881 -2.464114 0.842687
C  0.021016 -1.456897 -0.451728
C  -2.246221 -1.393633 -0.069357
C  -1.226293 -0.802852 -0.812437
C  -0.389386 -3.94205 -0.694617
C  1.953357 -2.876236 0.744633
C  -3.542426 -0.929727 -0.163195
C  -1.480419 0.272815 -1.645719
C  -3.791856 0.140285 -1.012323
C  -2.778659 0.744499 -1.747392
C  3.334991 -0.878489 0.44524
C  -1.343229 -4.672952 -2.708858
C  2.236116 1.311081 0.564035
C  4.478333 1.131109 -0.310963
C  1.682432 2.252395 -0.29285
C  1.711732 1.144704 1.835794
C  0.596188 3.005915 0.107606
C  0.598627 1.869811 2.230773
C  0.049104 2.792243 1.362792
C  6.549424 0.776732 -1.320158
C  -2.250867 3.219583 1.382784
H  -2.340268 -3.350283 0.904546
H  -1.589193 -2.075407 1.857769
H  2.646157 -3.022213 1.568346
H  2.15401 -3.63652 -0.016111
H  -4.345109 -1.37084 0.412688
H  -0.681576 0.73637 -2.208166
H  -3.010491 1.577664 -2.395387
H  -1.843204 -5.536912 -2.270606
H  -1.974645 -4.237549 -3.477887
H  -0.400631 -4.998578 -3.149234
H  2.090049 2.389451 -1.284189
H  2.161386 0.441587 2.525281
H  0.179396 3.75224 -0.554135
H  0.178417 1.736639 3.218328
H  7.081886 -0.072499 -1.738331
H  6.450946 1.555886 -2.076164
H  7.110299 1.174909 -0.47484
totalener: -2299.35369136 hartree
nucrepener: 4450.81545869 hartree
electener: -6750.16915005 hartree
twoeener: 5265.59445355 hartree
kineticenergy: 2291.82347004 hartree
xcener: -187.222115735661 hartree
chargesum: 0.0000000
charge: -0.068542 -0.178532 -0.154298 -0.168316 -0.310187 -0.258252 -0.322198 -0.350203 -0.270176 -0.366433 -0.291183 -0.216117 0.035407 -0.064653 0.528824 -0.205145 0.052333 -0.080225 0.045270 0.219441 0.047676 -0.148365 -0.256312 0.114652 -0.107123 0.244688 -0.142591 0.179915 0.429592 -0.160478 -0.191868 -0.131891 -0.120399 0.217545 -0.127243 0.585797 0.107107 0.100782 0.122308 0.115302 0.114372 0.127653 0.119031 0.112619 0.119344 0.113544 0.116330 0.127816 0.126194 0.127515 0.117683 0.109631 0.112359
qa: -0.0685 -0.1785 -0.1543 -0.1683 -0.3102 -0.2583 -0.3222 -0.3502 -0.2702 -0.3664 -0.2912 -0.2161 0.0354 -0.0647 0.5288 -0.2051 0.0523 -0.0802 0.0453 0.2194 0.0477 -0.1484 -0.2563 0.1147 -0.1071 0.2447 -0.1426 0.1799 0.4296 -0.1605 -0.1919 -0.1319 -0.1204 0.2175 -0.1272 0.5858 0.1071 0.1008 0.1223 0.1153 0.1144 0.1277 0.1190 0.1126 0.1193 0.1135 0.1163 0.1278 0.1262 0.1275 0.1177 0.1096 0.1124
va: 1.2373 1.1185 1.1589 1.1288 2.0727 2.1586 2.1816 2.1502 2.1321 2.1429 2.1059 2.9607 3.0936 3.0465 3.7803 3.9608 3.8203 3.8570 3.6207 4.2622 3.9896 4.0678 4.0281 3.9203 3.9351 4.4154 3.9020 3.7055 4.3119 4.0526 3.9924 4.0113 4.0178 3.8015 3.9029 4.6054 1.0031 1.0214 1.0091 0.9990 1.0218 1.0173 1.0158 0.9924 0.9944 0.9930 1.0141 1.0127 1.0129 1.0093 0.9951 0.9932 0.9950
dispcorr: -0.034930261 hartree
energy: -2299.388621622518
dipole: 28.11526 -28.61521 -0.49995 -23.97772 23.01040 -0.96731 -10.75858 9.55655 -1.20204
magnitude: 1.62189 au
magnitude: 4.12253 debye
