program: Orca
programVersion: 5.0.2
elementType: Cl F F F O O O O O O O N N N C C C C C C C C C C C C C C C C C C C C C C H H H H H H H H H H H H H H H H H
charge: 0
multiplicity: 1
keywords: wb97x-d3
keywords: def2-TZVPP
keywords: def2/J RIJCOSX
keywords: DEFGRID2
keywords: scfconv7
keywords: smallprint printgap noloewdin
keywords: NOSOSCF
formula: C22H17ClF3N3O7
InChI: InChI=1/C22H17ClF3N3O7/c1-33-18(30)21-10-12-9-13(23)3-8-16(12)17(21)27-28(11-35-21)19(31)29(20(32)34-2)14-4-6-15(7-5-14)36-22(24,25)26/h3-9H,10-11H2,1-2H3
53 atoms
Cl -4.233351 -4.073186 4.282975
F  -0.649156 6.45394 -2.359905
F  0.789239 8.049366 -2.509164
F  0.392466 7.117913 -0.608173
O  1.474997 -3.556471 -0.572585
O  -1.943213 -3.968503 -1.441192
O  -0.101704 -4.620757 -2.531512
O  2.990394 0.029566 -1.609326
O  1.957773 -0.314448 1.836144
O  0.686522 1.528747 2.009063
O  1.53416 6.059452 -2.196182
N  0.206812 -1.211722 -0.001932
N  1.321386 -1.221338 -0.756538
N  1.683239 0.964211 0.027381
C  0.105749 -3.645271 -0.32935
C  -0.244226 -4.593041 0.843373
C  -0.394083 -2.313711 0.176808
C  -1.375027 -3.881303 1.543079
C  -1.439912 -2.544498 1.15675
C  -0.637044 -4.129416 -1.581916
C  1.785922 -2.453538 -1.380829
C  -2.232866 -4.370414 2.508527
C  -2.336424 -1.666479 1.741271
C  -3.145658 -3.48966 3.07701
C  -3.202621 -2.150074 2.708208
C  2.086655 -0.079146 -0.823911
C  -2.77628 -4.447115 -2.493617
C  1.622802 2.271929 -0.517268
C  1.35617 0.773138 1.367007
C  0.877043 2.503813 -1.663442
C  2.314973 3.316575 0.077819
C  0.833545 3.767317 -2.227483
C  2.252734 4.588431 -0.462652
C  1.51804 4.802035 -1.615601
C  1.533534 -0.765782 3.114033
C  0.527735 6.899251 -1.915027
H  -0.492306 -5.606644 0.52497
H  0.628248 -4.66324 1.498651
H  2.86707 -2.40928 -1.480974
H  1.348715 -2.550608 -2.379675
H  -2.199501 -5.404069 2.826501
H  -2.362217 -0.625299 1.448321
H  -3.921987 -1.493867 3.177615
H  -3.795696 -4.24354 -2.180106
H  -2.570042 -3.929072 -3.429772
H  -2.647179 -5.518161 -2.647854
H  0.324476 1.6946 -2.122652
H  2.909559 3.141511 0.963674
H  0.273872 3.939615 -3.136208
H  2.79649 5.40383 -0.005679
H  0.47159 -1.016033 3.113167
H  2.114459 -1.660456 3.320413
H  1.723024 -0.022116 3.887555
totalener: -2299.35646634 hartree
nucrepener: 4176.46299091 hartree
electener: -6475.81945725 hartree
twoeener: 4990.68840916 hartree
kineticenergy: 2291.81075773 hartree
xcener: -187.218669211167 hartree
chargesum: -0.0000000
charge: -0.065352 -0.171869 -0.156018 -0.166765 -0.307192 -0.259800 -0.317803 -0.345726 -0.283614 -0.350197 -0.295185 -0.224747 0.054523 -0.071056 0.532883 -0.212994 0.071431 -0.072611 -0.056907 0.214678 0.041749 -0.141874 -0.229624 0.097035 -0.088768 0.255872 -0.141876 0.147994 0.418912 -0.167743 -0.164347 -0.080861 -0.095493 0.174681 -0.138955 0.574717 0.108161 0.100771 0.120366 0.115141 0.118859 0.143018 0.126545 0.119721 0.114820 0.112701 0.120437 0.122154 0.125279 0.124599 0.106199 0.118472 0.125659
qa: -0.0654 -0.1719 -0.1560 -0.1668 -0.3072 -0.2598 -0.3178 -0.3457 -0.2836 -0.3502 -0.2952 -0.2247 0.0545 -0.0711 0.5329 -0.2130 0.0714 -0.0726 -0.0569 0.2147 0.0417 -0.1419 -0.2296 0.0970 -0.0888 0.2559 -0.1419 0.1480 0.4189 -0.1677 -0.1643 -0.0809 -0.0955 0.1747 -0.1390 0.5747 0.1082 0.1008 0.1204 0.1151 0.1189 0.1430 0.1265 0.1197 0.1148 0.1127 0.1204 0.1222 0.1253 0.1246 0.1062 0.1185 0.1257
va: 1.2417 1.1300 1.1539 1.1364 2.0842 2.1561 2.1873 2.1617 2.0899 2.1606 2.1026 2.9463 3.0926 3.0304 3.7819 3.9537 3.7990 3.8303 3.6626 4.2641 4.0144 4.0531 4.0365 3.9507 3.9677 4.3568 3.9001 3.7651 4.3279 4.0755 4.0938 4.0197 4.0451 3.8625 3.8955 4.6336 1.0037 1.0209 1.0032 0.9968 1.0200 1.0179 1.0124 0.9942 0.9929 0.9927 1.0114 1.0110 1.0118 1.0093 0.9868 0.9932 0.9994
dispcorr: -0.031505554 hartree
energy: -2299.387971891643
dipole: 3.01049 -4.05318 -1.04269 -38.14943 36.08697 -2.06247 2.23143 -1.73355 0.49787
magnitude: 2.36408 au
magnitude: 6.00900 debye
