program: Orca
programVersion: 5.0.2
elementType: Cl F F F O O O O O O O N N N C C C C C C C C C C C C C C C C C C C C C C H H H H H H H H H H H H H H H H H
charge: 0
multiplicity: 1
keywords: wb97x-d3
keywords: def2-TZVPP
keywords: def2/J RIJCOSX
keywords: DEFGRID2
keywords: scfconv7
keywords: smallprint printgap noloewdin
keywords: NOSOSCF
formula: C22H17ClF3N3O7
InChI: InChI=1/C22H17ClF3N3O7/c1-33-18(30)21-10-12-9-13(23)3-8-16(12)17(21)27-28(11-35-21)19(31)29(20(32)34-2)14-4-6-15(7-5-14)36-22(24,25)26/h3-9H,10-11H2,1-2H3
53 atoms
Cl -4.545475 -4.994252 4.169644
F  3.41757 7.788658 0.010565
F  4.007472 6.15624 -1.264313
F  3.827451 5.846843 0.848393
O  1.570792 -3.451841 0.035379
O  0.216015 -3.267988 -2.13238
O  -1.612891 -4.203665 -1.245068
O  2.54027 0.227121 -1.174771
O  -1.691821 1.602642 -1.358805
O  -1.148631 -0.523743 -1.811999
O  1.983498 6.227134 -0.339088
N  -0.04252 -1.16842 0.677501
N  1.097332 -1.13198 -0.085929
N  0.381291 0.932883 -0.924458
C  0.195047 -3.576108 0.216959
C  -0.220037 -4.735902 1.141506
C  -0.435821 -2.361017 0.871168
C  -1.425603 -4.19472 1.858351
C  -1.516844 -2.811785 1.722551
C  -0.518109 -3.726152 -1.142795
C  2.083793 -2.154707 0.18484
C  -2.352596 -4.884399 2.616467
C  -2.52186 -2.091238 2.350696
C  -3.364434 -4.158857 3.229038
C  -3.456054 -2.7745 3.107348
C  1.42947 -0.001279 -0.769888
C  -0.375845 -3.272872 -3.42682
C  0.762111 2.300986 -0.796155
C  -0.863983 0.566832 -1.398933
C  0.829558 2.861497 0.468593
C  1.103648 3.049384 -1.910989
C  1.255807 4.169612 0.627224
C  1.520945 4.361163 -1.763779
C  1.601625 4.904868 -0.492739
C  -3.000323 1.378058 -1.866285
C  3.292208 6.489551 -0.18937
H  -0.421914 -5.663161 0.606616
H  0.588482 -4.930487 1.851221
H  2.43771 -2.016272 1.214987
H  2.917484 -2.032379 -0.500594
H  -2.302406 -5.958988 2.729581
H  -2.581599 -1.016698 2.241817
H  -4.259913 -2.245054 3.598985
H  -0.588485 -4.289008 -3.759306
H  -1.293689 -2.68855 -3.442497
H  0.356968 -2.819331 -4.087626
H  0.551471 2.268108 1.329472
H  1.058732 2.601933 -2.894396
H  1.307397 4.61644 1.610486
H  1.782648 4.954483 -2.628989
H  -2.981164 1.098781 -2.919792
H  -3.518798 0.599339 -1.307185
H  -3.526664 2.321234 -1.751523
totalener: -2299.35562272 hartree
nucrepener: 4193.20657798 hartree
electener: -6492.56220070 hartree
twoeener: 5008.49406021 hartree
kineticenergy: 2291.80746189 hartree
xcener: -187.215077738801 hartree
chargesum: -0.0000000
charge: -0.066215 -0.154828 -0.167922 -0.167373 -0.324154 -0.235469 -0.348284 -0.366812 -0.277690 -0.408291 -0.296039 -0.225320 0.043513 -0.092335 0.472291 -0.103872 0.114383 -0.099611 -0.079649 0.246091 0.067708 -0.159737 -0.188943 0.128553 -0.125617 0.314981 -0.148883 0.109740 0.475430 -0.193844 -0.178606 -0.081232 -0.074366 0.180339 -0.136273 0.575778 0.106096 0.095267 0.100113 0.112151 0.116698 0.133139 0.119317 0.117847 0.116957 0.116797 0.127002 0.116252 0.126930 0.126645 0.108407 0.113258 0.119685
qa: -0.0662 -0.1548 -0.1679 -0.1674 -0.3242 -0.2355 -0.3483 -0.3668 -0.2777 -0.4083 -0.2960 -0.2253 0.0435 -0.0923 0.4723 -0.1039 0.1144 -0.0996 -0.0796 0.2461 0.0677 -0.1597 -0.1889 0.1286 -0.1256 0.3150 -0.1489 0.1097 0.4754 -0.1938 -0.1786 -0.0812 -0.0744 0.1803 -0.1363 0.5758 0.1061 0.0953 0.1001 0.1122 0.1167 0.1331 0.1193 0.1178 0.1170 0.1168 0.1270 0.1163 0.1269 0.1266 0.1084 0.1133 0.1197
va: 1.2412 1.1556 1.1357 1.1353 2.0395 2.1885 2.1641 2.1463 2.1119 2.0942 2.1034 2.8982 3.1433 3.0197 3.8226 3.9134 3.8663 3.9678 3.7291 4.2981 4.0065 4.0802 4.0516 3.9349 4.0119 4.3182 3.8936 3.6841 4.2494 4.1198 4.1531 4.0036 4.0059 3.8664 3.9038 4.6301 1.0136 1.0185 0.9908 1.0104 1.0209 1.0146 1.0172 0.9959 0.9997 0.9937 1.0210 1.0181 1.0101 1.0108 0.9958 0.9937 0.9942
dispcorr: -0.031371254 hartree
energy: -2299.386993972378
dipole: -14.57069 13.71680 -0.85389 -25.54837 25.36117 -0.18720 -14.18395 14.17274 -0.01121
magnitude: 0.87424 au
magnitude: 2.22214 debye
