program: Orca
programVersion: 5.0.2
elementType: Cl F F F O O O O O O O N N N C C C C C C C C C C C C C C C C C C C C C C H H H H H H H H H H H H H H H H H
charge: 0
multiplicity: 1
keywords: wb97x-d3
keywords: def2-TZVPP
keywords: def2/J RIJCOSX
keywords: DEFGRID2
keywords: scfconv7
keywords: smallprint printgap noloewdin
keywords: NOSOSCF
formula: C22H17ClF3N3O7
InChI: InChI=1/C22H17ClF3N3O7/c1-33-18(30)21-10-12-9-13(23)3-8-16(12)17(21)27-28(11-35-21)19(31)29(20(32)34-2)14-4-6-15(7-5-14)36-22(24,25)26/h3-9H,10-11H2,1-2H3
53 atoms
Cl -5.140818 1.036359 -1.747667
F  -2.603158 2.654166 0.464438
F  -3.239267 3.407914 2.377357
F  -2.450323 1.411191 2.206125
O  0.620213 -2.729423 1.294772
O  -1.247602 -3.627648 -1.589802
O  -0.138358 -4.910417 -0.133953
O  4.338309 -1.425464 0.884747
O  5.311953 0.371928 -0.951166
O  4.58934 2.386696 -0.282867
O  -1.127368 3.194129 2.038929
N  1.284894 -0.913269 -0.643255
N  2.23394 -1.545726 0.084633
N  3.348772 0.511536 0.107832
C  -0.321219 -2.53681 0.286719
C  -1.687356 -2.041573 0.814467
C  0.107698 -1.383579 -0.594419
C  -2.147942 -1.092634 -0.261921
C  -1.08457 -0.703334 -1.073591
C  -0.536527 -3.841539 -0.494429
C  1.917436 -2.790628 0.761738
C  -3.407496 -0.563215 -0.455419
C  -1.254727 0.232987 -2.077957
C  -3.575658 0.359788 -1.479309
C  -2.51789 0.762821 -2.285661
C  3.397338 -0.87226 0.38294
C  -1.57533 -4.766728 -2.380859
C  2.244706 1.254815 0.607001
C  4.462923 1.197693 -0.363629
C  1.586241 2.179549 -0.192076
C  1.789373 1.006898 1.892752
C  0.461552 2.828583 0.279786
C  0.646149 1.633555 2.362664
C  -0.011485 2.534205 1.548324
C  6.529817 0.939417 -1.410492
C  -2.330557 2.668676 1.768965
H  -2.391978 -2.846822 1.02661
H  -1.517178 -1.498324 1.747942
H  2.613577 -2.93286 1.583506
H  2.027928 -3.62767 0.065636
H  -4.242946 -0.845906 0.170985
H  -0.421586 0.537944 -2.696466
H  -2.686894 1.487647 -3.069513
H  -2.167934 -4.391452 -3.209654
H  -0.679219 -5.255515 -2.762721
H  -2.157085 -5.492696 -1.813327
H  1.937302 2.377167 -1.194434
H  2.320493 0.318091 2.537409
H  -0.0481 3.553439 -0.339565
H  0.287161 1.43882 3.363987
H  6.357819 1.69297 -2.17909
H  7.093925 1.390877 -0.594611
H  7.099162 0.114821 -1.829124
totalener: -2299.35332459 hartree
nucrepener: 4490.42792102 hartree
electener: -6789.78124561 hartree
twoeener: 5305.10962683 hartree
kineticenergy: 2291.82093396 hartree
xcener: -187.220321980086 hartree
chargesum: 0.0000000
charge: -0.068891 -0.168237 -0.152662 -0.179115 -0.311996 -0.257462 -0.320798 -0.336993 -0.271106 -0.372010 -0.292101 -0.210119 0.028771 -0.054561 0.530850 -0.201040 0.048957 -0.087236 0.062611 0.216765 0.056737 -0.167969 -0.273777 0.109964 -0.077544 0.227899 -0.143776 0.195562 0.432617 -0.169620 -0.224210 -0.105364 -0.110296 0.203945 -0.128558 0.586854 0.108788 0.100279 0.121401 0.111989 0.113162 0.128946 0.118560 0.119407 0.113917 0.112809 0.112420 0.131029 0.122608 0.128918 0.109240 0.112380 0.118057
qa: -0.0689 -0.1682 -0.1527 -0.1791 -0.3120 -0.2575 -0.3208 -0.3370 -0.2711 -0.3720 -0.2921 -0.2101 0.0288 -0.0546 0.5309 -0.2010 0.0490 -0.0872 0.0626 0.2168 0.0567 -0.1680 -0.2738 0.1100 -0.0775 0.2279 -0.1438 0.1956 0.4326 -0.1696 -0.2242 -0.1054 -0.1103 0.2039 -0.1286 0.5869 0.1088 0.1003 0.1214 0.1120 0.1132 0.1289 0.1186 0.1194 0.1139 0.1128 0.1124 0.1310 0.1226 0.1289 0.1092 0.1124 0.1181
va: 1.2366 1.1283 1.1618 1.1152 2.0634 2.1574 2.1834 2.1599 2.1317 2.1391 2.1062 2.9512 3.0871 3.0375 3.7784 3.9530 3.8129 3.8038 3.5655 4.2762 3.9866 4.0399 4.0623 3.9065 3.9600 4.4321 3.9026 3.6918 4.3058 4.0601 4.0093 3.9911 3.9813 3.8045 3.9043 4.6012 1.0042 1.0256 1.0098 0.9989 1.0215 1.0161 1.0144 0.9943 0.9928 0.9927 1.0190 1.0147 1.0122 1.0098 0.9937 0.9946 0.9949
dispcorr: -0.036045829 hartree
energy: -2299.389370420241
dipole: 27.40313 -27.90594 -0.50281 -21.39511 20.54147 -0.85364 -11.16859 9.94112 -1.22748
magnitude: 1.57741 au
magnitude: 4.00946 debye
