program: Orca
programVersion: 5.0.2
elementType: Cl F F F O O O O O O O N N N C C C C C C C C C C C C C C C C C C C C C C H H H H H H H H H H H H H H H H H
charge: 0
multiplicity: 1
keywords: wb97x-d3
keywords: def2-TZVPP
keywords: def2/J RIJCOSX
keywords: DEFGRID2
keywords: scfconv7
keywords: smallprint printgap noloewdin
keywords: NOSOSCF
formula: C22H17ClF3N3O7
InChI: InChI=1/C22H17ClF3N3O7/c1-33-18(30)21-10-12-9-13(23)3-8-16(12)17(21)27-28(11-35-21)19(31)29(20(32)34-2)14-4-6-15(7-5-14)36-22(24,25)26/h3-9H,10-11H2,1-2H3
53 atoms
Cl -5.987044 -4.149349 0.566039
F  -0.154558 7.145931 -0.147686
F  1.403866 8.306072 0.778049
F  0.439932 6.726402 1.874628
O  1.243853 -2.899074 2.00776
O  0.106278 -4.522222 -0.935161
O  1.980893 -4.875284 0.234581
O  3.323327 0.217673 0.488794
O  1.246271 -0.842764 -2.265572
O  0.093259 1.059758 -2.575132
O  1.863425 6.290329 0.21949
N  0.162132 -1.133898 0.22926
N  1.475069 -1.059297 0.535378
N  1.558843 0.842839 -0.8395
C  0.286857 -3.398694 1.123891
C  -0.85758 -4.139419 1.851149
C  -0.4139 -2.236404 0.474941
C  -2.094458 -3.663314 1.135062
C  -1.829708 -2.528708 0.370916
C  0.918758 -4.3438 0.09682
C  2.158747 -2.03648 1.402725
C  -3.374513 -4.176382 1.208749
C  -2.839961 -1.875059 -0.316466
C  -4.379236 -3.526277 0.503341
C  -4.125578 -2.385308 -0.251412
C  2.209993 0.001633 0.082674
C  0.522302 -5.451848 -1.931195
C  1.604163 2.241936 -0.581201
C  0.870317 0.395188 -1.951268
C  2.748558 2.971067 -0.861357
C  0.504312 2.871249 -0.026119
C  2.788626 4.323452 -0.580725
C  0.528183 4.2288 0.253532
C  1.682312 4.947007 -0.023364
C  0.500089 -1.483353 -3.287738
C  0.893864 7.092458 0.673675
H  -0.743688 -5.224526 1.853453
H  -0.868443 -3.813906 2.894765
H  2.663546 -1.500877 2.204601
H  2.90939 -2.574804 0.815901
H  -3.599485 -5.055302 1.798263
H  -2.628672 -0.988614 -0.900612
H  -4.93377 -1.905385 -0.785187
H  -0.273613 -5.472381 -2.669754
H  1.454649 -5.139801 -2.401912
H  0.658026 -6.449506 -1.51319
H  3.60995 2.480229 -1.291001
H  -0.385019 2.295971 0.192389
H  3.677905 4.90234 -0.789623
H  -0.352099 4.679068 0.685919
H  0.537587 -0.928827 -4.224914
H  0.960674 -2.458069 -3.425366
H  -0.542547 -1.617175 -2.995753
totalener: -2299.35534736 hartree
nucrepener: 4181.48859993 hartree
electener: -6480.84394729 hartree
twoeener: 4995.61635459 hartree
kineticenergy: 2291.79763215 hartree
xcener: -187.217154573212 hartree
chargesum: -0.0000000
charge: -0.064394 -0.167403 -0.153250 -0.170144 -0.312718 -0.264853 -0.317570 -0.370332 -0.292373 -0.365649 -0.263630 -0.229658 0.052172 -0.102016 0.518831 -0.195330 0.110942 -0.088358 -0.056018 0.212874 0.031110 -0.144013 -0.214139 0.115564 -0.118213 0.319333 -0.163841 0.120676 0.444154 -0.177752 -0.199471 -0.112803 -0.079402 0.230706 -0.139665 0.568257 0.106886 0.104533 0.124905 0.124895 0.118723 0.143729 0.123576 0.124006 0.115711 0.125132 0.120340 0.120117 0.126730 0.113019 0.132754 0.107384 0.105933
qa: -0.0644 -0.1674 -0.1533 -0.1701 -0.3127 -0.2649 -0.3176 -0.3703 -0.2924 -0.3656 -0.2636 -0.2297 0.0522 -0.1020 0.5188 -0.1953 0.1109 -0.0884 -0.0560 0.2129 0.0311 -0.1440 -0.2141 0.1156 -0.1182 0.3193 -0.1638 0.1207 0.4442 -0.1778 -0.1995 -0.1128 -0.0794 0.2307 -0.1397 0.5683 0.1069 0.1045 0.1249 0.1249 0.1187 0.1437 0.1236 0.1240 0.1157 0.1251 0.1203 0.1201 0.1267 0.1130 0.1328 0.1074 0.1059
va: 1.2430 1.1368 1.1572 1.1315 2.0918 2.1420 2.1899 2.1481 2.0827 2.1493 2.1560 2.9240 3.0765 3.0257 3.8229 3.9543 3.8227 3.9042 3.6854 4.2543 3.9980 4.0538 4.0459 3.9404 4.0137 4.3507 3.8946 3.7433 4.3047 4.1503 4.1701 3.9823 3.9247 3.8846 3.8990 4.6401 1.0040 1.0200 0.9968 0.9962 1.0208 1.0173 1.0157 0.9907 0.9906 0.9968 1.0253 1.0251 1.0110 1.0336 0.9998 0.9937 0.9910
dispcorr: -0.031747500 hartree
energy: -2299.387094860529
dipole: 8.55366 -9.36768 -0.81403 -41.85827 39.66390 -2.19437 -13.09417 12.54555 -0.54862
magnitude: 2.40393 au
magnitude: 6.11030 debye
