program: Gaussian 09
title: 000054705
version: EM64L-G09RevD.01
frameworkgroup: C1[X(C21H22N4O3)]
method: RPBEPBE
basis: SDD
operation: Freq
keyword: #p
keyword: freq=noraman
keyword: PBEPBE/SDD
title: #p freq=noraman PBEPBE/SDD
converged: YES YES NO NO
title: Mulliken charges:
elementType: O O O N N N N C C C C C C C C C C C C C C C C C C C C C H H H H H H H H H H H H H H H H H H H H H H
charge: -0.255610 -0.251625 -0.313046 -0.146934 -0.266504 -0.405821 -0.388100 0.345349 0.030959 0.091102 0.452825 -0.209157 -0.638801 -0.750845 0.176342 -0.358458 -0.388590 -0.730042 -0.215733 -0.213037 0.202124 -0.252586 0.266444 -0.345296 -0.358704 -0.221721 -0.234439 -0.224320 0.379291 0.285164 0.268144 0.239093 0.246490 0.216872 0.250961 0.277217 0.286043 0.261207 0.223605 0.229773 0.246681 0.313306 0.228127 0.226077 0.228991 0.278693 0.217103 0.235408 0.231416 0.234562
chargesum: 0.00000
title: Mulliken charges with hydrogens summed into heavy atoms:
elementType: O O O N N N N C C C C C C C C C C C C C C C C C C C C C
charge: -0.255610 -0.251625 -0.313046 -0.146934 -0.266504 -0.026531 -0.074793 0.345349 0.030959 0.091102 0.452825 0.076007 0.114927 -0.005795 0.176342 -0.072415 -0.127383 -0.029983 0.012394 0.013039 0.202124 -0.023596 0.266444 -0.066602 -0.141602 0.013688 -0.003023 0.010243
polarizability: 3.56555748e+02 -3.45774844e+01 2.59645304e+02 -1.69553203e+01 3.41053040e+00 2.16649442e+02
1716.lowfreq: -20.8074 -5.1084 -5.0033 -0.6363 -0.0005 0.0003 0.0006 12.2694 19.2327
frequency: -20.4644 12.0206 19.1906 28.7308 42.5234 55.7897 57.4835 71.3477 82.6514 95.9872 111.7905 122.6653 136.9465 151.0360 164.5242 170.1369 185.8630 204.2520 219.8298 247.5140 253.5478 271.4137 278.1634 283.4329 311.4898 330.6113 354.3933 369.1912 398.3655 404.6382 409.5832 420.2883 433.2589 452.4366 496.7131 501.9419 541.1262 572.6436 583.5509 602.2567 614.4093 615.0848 619.0154 649.8342 662.6624 683.5153 689.8218 700.0262 702.4604 717.5319 756.6464 765.2346 786.4586 794.4445 818.9408 842.3942 844.0001 854.8347 879.7879 909.1613 915.1621 922.1862 937.8217 971.0442 985.1179 985.3807 989.7468 990.5083 1007.4402 1011.1242 1024.6882 1032.5049 1034.6116 1039.8030 1053.3199 1077.5827 1082.7499 1094.7905 1104.7253 1114.3428 1137.3619 1142.8997 1159.2081 1172.1333 1174.5064 1186.4571 1189.9167 1190.6126 1217.6579 1261.5425 1300.5189 1313.3749 1317.0321 1318.0573 1334.7117 1335.2805 1377.6681 1385.6523 1386.0784 1392.5097 1405.0134 1430.4807 1431.9518 1443.5080 1447.7857 1457.0023 1461.4044 1467.0510 1469.4206 1475.4727 1485.6396 1490.9499 1494.1637 1527.5519 1553.6796 1589.1877 1596.8339 1608.5643 1611.2041 1623.2514 1632.3241 1645.6936 2977.1365 2994.8619 2998.5838 3013.3368 3084.0781 3087.2901 3096.9940 3098.7007 3109.6319 3119.4250 3127.6535 3128.3826 3133.9893 3139.2165 3147.3260 3153.4783 3160.3096 3165.5739 3171.6330 3190.3078 3281.1009 3550.0281
redmass: 1.3885 5.3855 4.4148 3.5952 6.1744 3.1393 3.7497 5.5230 5.9925 4.4037 5.1905 5.8809 3.5670 2.3995 2.4025 1.7132 1.1967 3.2231 4.4447 4.8089 4.1434 4.1923 5.0156 3.8118 4.8575 4.0563 5.3538 5.6061 3.9480 3.4415 2.9900 4.5611 5.9497 3.8012 4.5538 3.3640 1.2386 5.4660 5.1286 4.8456 6.3431 6.2040 5.9614 5.5901 6.1454 4.8265 3.7259 1.8770 2.2250 5.1302 3.1089 2.0102 1.6344 2.2338 2.9774 1.6994 2.3608 1.2644 3.4439 1.9553 1.8221 2.1727 1.4747 1.3624 1.4394 3.9208 5.1843 1.4810 1.3454 3.4177 2.3427 1.9620 1.7566 1.5494 2.4490 2.1385 1.5853 1.9510 2.4925 2.1204 2.0272 2.6702 3.0359 1.0516 1.0591 1.2357 2.7543 1.1321 2.6988 1.6690 3.8431 1.8934 1.3528 1.6752 2.3191 1.5337 2.7474 9.0984 6.2204 1.2266 1.4393 1.1477 2.2238 1.7245 1.3418 1.2772 1.4048 1.0712 1.0953 1.1289 2.4083 2.3916 1.1013 2.2607 4.7765 6.4733 6.4369 6.3074 6.0391 5.4055 10.0452 7.4306 1.0421 1.0365 1.0363 1.0843 1.0978 1.0917 1.1007 1.0997 1.0989 1.0874 1.0873 1.0988 1.0872 1.0892 1.0921 1.0940 1.0959 1.0995 1.1006 1.0961 1.0814 1.0776
irintensity: 2.6509 0.2454 1.6055 0.2988 0.8877 2.1323 1.7801 10.4433 3.5755 3.6661 6.5180 3.2753 3.2311 7.1633 1.2518 1.6891 1.1264 8.6791 3.8046 3.6851 1.5979 11.4841 1.9101 10.0897 2.7255 10.8629 2.0170 1.1495 2.6069 1.0827 0.7268 9.7154 25.4820 3.6625 1.1394 10.9068 116.4992 16.4888 7.0878 24.1158 0.5524 3.2509 23.6365 2.9247 5.0274 15.6191 9.4606 37.3235 106.5971 20.9054 24.7515 44.5952 116.2098 37.7312 35.9550 1.2793 5.4293 0.7344 3.3343 3.1897 2.4125 13.1113 2.8077 0.8876 0.9676 0.5646 0.6506 0.5918 1.2130 19.7335 6.9331 3.6400 10.0537 1.9547 12.7196 10.1987 12.1762 5.0485 13.1475 10.6104 48.7870 5.5918 46.8534 0.2702 1.2748 0.9504 7.9653 9.9407 79.9217 57.2385 150.7672 13.3777 1.2623 70.5771 81.6924 45.7851 48.9156 2.3127 9.9942 38.0634 47.4669 17.7221 8.9830 12.0178 4.2503 112.0654 88.5327 13.1085 53.1753 16.0416 150.7853 86.9400 9.9068 418.6262 33.9648 3.2897 10.8524 88.2864 6.2749 309.9671 154.7715 24.3711 62.1707 16.7297 21.4315 4.2183 5.0141 13.6560 24.5808 19.2679 19.0889 9.3147 5.6113 7.7424 1.6684 13.2197 20.3554 29.1971 16.4285 21.1730 20.5592 1.7843 294.1099 16.7040
temp: 298.150 k
press: 1.00000 atm
elementType: 8 8 8 7 7 7 7 6 6 6 6 6 6 6 6 6 6 6 6 6 6 6 6 6 6 6 6 6 1 1 1 1 1 1 1 1 1 1 1 1 1 1 1 1 1 1 1 1 1 1
symmnumber: 1
zpe: 1036567.8 jmol-1
zpe.correction: 0.394808 hartree
zpe.thermalcorrener: 0.420529 hartree
zpe.thermalcorrenthalpy: 0.421473 hartree
zpe.thermalcorrgfe: 0.336387 hartree
zpe.sumelectzpe: -1256.123391 hartree
zpe.sumelectthermal: -1256.097670 hartree
zpe.sumelectthermalent: -1256.096726 hartree
zpe.sumelectthermalfe: -1256.181812 hartree
dipole: -2.3665 0.8898 5.2460
dipole: 5.8235
quadrupole: -119.5269 -160.5993 -162.2611
quadrupole: -0.5825 2.1827 -5.0287
quadrupole: 27.9355 -13.1369 -14.7987 -0.5825 2.1827 -5.0287
hfenergy: -1256.5181991 hartree
pointgroup: C01 [X(C21H22N4O3)]
dipole: -1.0900216 0.6183554 1.9180225 debye
polarizability: 359.426745|-33.6513972|257.801509|-1.3376685|-5.6362675|215.6222407 unknown
InChI: InChI=1S/C21H22N4O3/c1-14(22-20(27)16-10-6-4-7-11-16)19(26)23-18-15(2)24(3)25(21(18)28)17-12-8-5-9-13-17/h4-14,22-23H,1-3H3
charge 0 multiplicity 1
50 atoms
O  2.174588 -0.813129 -1.919459
O  -0.731018 2.907466 -0.423243
O  -2.180148 -1.267256 -1.669686
N  2.8027 0.753131 1.225954
N  3.235247 0.01007 0.078212
N  -0.225601 0.650789 -0.84426
N  -3.267623 0.679965 -1.046099
C  1.452626 1.115196 0.994829
C  1.03772 0.592482 -0.220583
C  2.145225 -0.140826 -0.846486
C  4.411008 -0.795317 0.138571
C  -2.316804 1.552907 -1.773441
C  3.762073 1.778332 1.715092
C  0.69488 1.914798 2.012025
C  -1.01632 1.785225 -0.940698
C  5.062253 -1.154411 -1.07013
C  4.916758 -1.250957 1.384548
C  -2.981394 2.887689 -2.132723
C  6.218333 -1.960733 -1.019886
C  6.085252 -2.041216 1.417586
C  -3.168854 -0.698341 -1.086954
C  6.743335 -2.399732 0.218455
C  -4.252149 -1.492151 -0.414131
C  -3.966264 -2.843712 -0.091411
C  -5.534091 -0.960447 -0.112033
C  -4.936757 -3.645004 0.543934
C  -6.505423 -1.764657 0.522708
C  -6.207257 -3.10631 0.857472
H  -0.559807 -0.193048 -1.348608
H  -2.033224 0.998693 -2.688556
H  4.720118 1.3002 1.96912
H  3.344571 2.237979 2.623976
H  3.937221 2.56347 0.953785
H  1.115189 1.779684 3.023561
H  -0.357292 1.585647 2.025463
H  0.676185 2.988023 1.752665
H  4.647063 -0.821146 -2.023719
H  4.375158 -1.017076 2.307036
H  -3.899124 2.714517 -2.721627
H  -3.221941 3.466899 -1.223862
H  -2.288777 3.504316 -2.728181
H  -3.97119 1.13048 -0.458529
H  6.713904 -2.241783 -1.955642
H  6.470846 -2.3908 2.38194
H  7.646551 -3.018561 0.247843
H  -2.980502 -3.240275 -0.355179
H  -5.800861 0.063389 -0.401591
H  -4.706203 -4.686334 0.793166
H  -7.495013 -1.351076 0.745292
H  -6.962568 -3.728949 1.349586
