program: Orca
programVersion: 5.0.2
elementType: O O O O O N C C C C C C C C C C C C C C C C C C C C C H H H H H H H H H H H H H H H H H H H H H H H H H H H
charge: 0
multiplicity: 1
keywords: wb97x-d3
keywords: def2-TZVPP
keywords: def2/J RIJCOSX
keywords: DEFGRID2
keywords: scfconv7
keywords: smallprint printgap noloewdin
keywords: NOSOSCF
formula: C21H27NO5
InChI: InChI=1/C21H27NO5/c1-5-26-20(24)27-18-17(16-12-13(2)6-7-14(16)3)19(23)22-21(18)10-8-15(25-4)9-11-21/h6-7,12,15,22H,5,8-11H2,1-4H3
54 atoms
O  5.769926 0.317409 -0.064294
O  -0.371724 1.009008 0.790038
O  0.013932 -3.26318 -1.209364
O  -1.278684 2.936755 0.890534
O  -0.877542 2.053883 -1.144687
N  1.536239 -1.644268 -0.624399
C  1.555934 -0.31624 -0.044676
C  2.299502 -0.297375 1.299348
C  2.17987 0.711662 -0.99859
C  3.797818 -0.515591 1.120129
C  3.678203 0.488373 -1.167035
C  4.391602 0.524003 0.174693
C  0.08388 -0.108246 0.151789
C  -0.647849 -1.153345 -0.22415
C  0.302837 -2.166055 -0.748408
C  -2.099053 -1.362896 -0.129582
C  6.605879 0.670019 1.014988
C  -2.615421 -2.266673 0.806353
C  -2.955957 -0.653927 -0.968657
C  -0.854468 2.026209 0.055174
C  -4.335488 -0.814908 -0.909073
C  -3.997884 -2.423664 0.861862
C  -1.7257 -3.036285 1.736079
C  -4.84343 -1.714984 0.023577
C  -5.246927 -0.055312 -1.825564
C  -1.842904 4.149042 0.341505
C  -0.777149 5.131823 -0.0724
H  1.878717 -1.057765 1.96035
H  2.131826 0.671802 1.77661
H  2.014242 1.712444 -0.590588
H  1.677247 0.669352 -1.965825
H  4.272815 -0.465204 2.102234
H  3.995455 -1.518087 0.725849
H  3.867738 -0.472115 -1.658216
H  4.079152 1.262805 -1.824371
H  4.242982 1.521166 0.62014
H  2.372675 -2.129325 -0.913849
H  6.483099 0.015647 1.883661
H  7.638175 0.585919 0.675386
H  6.435861 1.702277 1.341882
H  -2.53553 0.032274 -1.693085
H  -4.420777 -3.111536 1.584278
H  -0.953714 -2.404994 2.178857
H  -2.301993 -3.476735 2.548772
H  -1.216006 -3.852666 1.221123
H  -5.914529 -1.862045 0.099993
H  -4.717222 0.74017 -2.348117
H  -5.683377 -0.710757 -2.581561
H  -6.075605 0.395814 -1.278822
H  -2.444423 4.549175 1.154323
H  -2.511951 3.902228 -0.482911
H  -1.26195 6.055435 -0.389241
H  -0.178437 4.769594 -0.907222
H  -0.113755 5.373206 0.757593
elementType: O N C H
totalener: -1247.55295849 hartree
nucrepener: 2620.04129966 hartree
electener: -3867.59425815 hartree
oneelecener: -6908.36900638 hartree
twoeener: 3040.77474823 hartree
cpcmener: -0.05282331 hartree
kineticenergy: 1242.07569340 hartree
xcener: -120.046220116076 hartree
chargesum: -0.0000000
charge: -0.398838 -0.315224 -0.547293 -0.291275 -0.466464 -0.211368 0.559314 -0.269608 -0.268789 -0.171820 -0.182779 0.182923 0.086055 0.125020 0.272470 0.020061 -0.114028 -0.161534 -0.227013 0.569779 -0.034469 -0.102044 -0.254435 -0.172344 -0.229356 0.043395 -0.254339 0.102487 0.098981 0.097115 0.101742 0.089773 0.082577 0.082333 0.086353 0.063397 0.174796 0.092537 0.118549 0.092895 0.140127 0.141772 0.106177 0.101453 0.103340 0.142833 0.092452 0.104609 0.100166 0.115402 0.101063 0.099358 0.090392 0.091328
qa: -0.3988 -0.3152 -0.5473 -0.2913 -0.4665 -0.2114 0.5593 -0.2696 -0.2688 -0.1718 -0.1828 0.1829 0.0861 0.1250 0.2725 0.0201 -0.1140 -0.1615 -0.2270 0.5698 -0.0345 -0.1020 -0.2544 -0.1723 -0.2294 0.0434 -0.2543 0.1025 0.0990 0.0971 0.1017 0.0898 0.0826 0.0823 0.0864 0.0634 0.1748 0.0925 0.1185 0.0929 0.1401 0.1418 0.1062 0.1015 0.1033 0.1428 0.0925 0.1046 0.1002 0.1154 0.1011 0.0994 0.0904 0.0913
va: 1.9429 2.1121 1.9712 2.1458 2.0161 3.2548 3.5492 4.0297 4.0060 3.7892 3.8881 3.8748 3.9620 3.2657 4.3594 3.3220 3.9060 3.8615 3.9236 4.2996 3.7900 3.8481 3.9182 3.9335 3.9138 3.8459 3.9223 1.0120 1.0145 1.0117 1.0189 1.0161 1.0246 1.0253 1.0213 1.0069 1.0134 0.9822 0.9913 0.9909 1.0227 0.9997 0.9935 1.0045 1.0055 0.9964 1.0053 0.9935 0.9967 0.9956 1.0056 1.0064 1.0114 1.0042
dispcorr: -0.029068610 hartree
energy: -1247.582027099080
dipole: 10.16443 -9.48628 0.67815 12.09722 -8.99626 3.10096 4.45338 -2.48009 1.97329
magnitude: 3.73761 au
magnitude: 9.50025 debye
