program: Orca
programVersion: 5.0.2
elementType: O O O O O N C C C C C C C C C C C C C C C C C C C C C H H H H H H H H H H H H H H H H H H H H H H H H H H H
charge: 0
multiplicity: 1
keywords: wb97x-d3
keywords: def2-TZVPP
keywords: def2/J RIJCOSX
keywords: DEFGRID2
keywords: scfconv7
keywords: smallprint printgap noloewdin
keywords: NOSOSCF
formula: C21H27NO5
InChI: InChI=1/C21H27NO5/c1-5-26-20(24)27-18-17(16-12-13(2)6-7-14(16)3)19(23)22-21(18)10-8-15(25-4)9-11-21/h6-7,12,15,22H,5,8-11H2,1-4H3
54 atoms
O  5.780706 0.158468 0.353325
O  -0.395907 0.980644 0.848515
O  0.034041 -3.30243 -1.119664
O  -1.27736 2.923867 0.893773
O  -0.747839 2.040969 -1.111735
N  1.547036 -1.698393 -0.474126
C  1.557977 -0.364503 0.091819
C  2.253524 -0.34073 1.461521
C  2.229814 0.645083 -0.848396
C  3.752379 -0.584367 1.335674
C  3.729612 0.395096 -0.964898
C  4.394601 0.43437 0.407096
C  0.081409 -0.14262 0.235103
C  -0.644591 -1.18733 -0.154034
C  0.314253 -2.209051 -0.644729
C  -2.101451 -1.371406 -0.124383
C  6.549427 1.189493 -0.224588
C  -2.682688 -2.28557 0.761895
C  -2.901302 -0.61728 -0.980504
C  -0.808408 2.009068 0.086796
C  -4.285331 -0.740509 -0.987025
C  -4.069663 -2.410244 0.746262
C  -1.855945 -3.09552 1.715618
C  -4.858143 -1.655378 -0.107927
C  -5.130899 0.078193 -1.915882
C  -1.840434 4.119043 0.307149
C  -0.782237 5.117327 -0.090963
H  1.797912 -1.086761 2.115379
H  2.084647 0.636606 1.921021
H  2.068707 1.651576 -0.452923
H  1.759614 0.604905 -1.831749
H  4.205727 -0.524945 2.32748
H  3.943304 -1.595096 0.960072
H  3.92372 -0.574562 -1.436014
H  4.152124 1.15393 -1.626471
H  4.239518 1.438746 0.83436
H  2.386824 -2.174593 -0.768489
H  6.368359 1.308268 -1.297349
H  6.364022 2.155615 0.258959
H  7.600621 0.936136 -0.088708
H  -2.429932 0.076582 -1.665119
H  -4.542851 -3.107742 1.427214
H  -2.483195 -3.564242 2.473042
H  -1.31456 -3.893559 1.205072
H  -1.113713 -2.483651 2.231229
H  -5.934944 -1.776514 -0.085371
H  -5.957994 0.55314 -1.387179
H  -4.548195 0.862273 -2.398051
H  -5.567308 -0.539052 -2.703361
H  -2.474348 4.521248 1.093908
H  -2.479359 3.847414 -0.533644
H  -1.277575 6.029119 -0.425673
H  -0.158714 4.76071 -0.909632
H  -0.142247 5.378141 0.7515
elementType: O N C H
totalener: -1247.55267939 hartree
nucrepener: 2621.56680630 hartree
electener: -3869.11948569 hartree
oneelecener: -6911.37102210 hartree
twoeener: 3042.25153641 hartree
cpcmener: -0.05238406 hartree
kineticenergy: 1242.07222155 hartree
xcener: -120.045716865869 hartree
chargesum: 0.0000000
charge: -0.397322 -0.313622 -0.547146 -0.291957 -0.466615 -0.213197 0.555585 -0.250499 -0.284225 -0.181521 -0.172731 0.178391 0.092335 0.118570 0.274093 0.023868 -0.114720 -0.162107 -0.234550 0.571153 -0.032736 -0.099467 -0.255365 -0.173185 -0.229962 0.042814 -0.254661 0.102619 0.096416 0.097623 0.101521 0.085284 0.083328 0.081423 0.091769 0.064081 0.174981 0.093184 0.092857 0.118770 0.143494 0.141803 0.100723 0.103495 0.106971 0.143090 0.100283 0.092415 0.104712 0.115466 0.101703 0.099678 0.090014 0.091074
qa: -0.3973 -0.3136 -0.5471 -0.2920 -0.4666 -0.2132 0.5556 -0.2505 -0.2842 -0.1815 -0.1727 0.1784 0.0923 0.1186 0.2741 0.0239 -0.1147 -0.1621 -0.2345 0.5712 -0.0327 -0.0995 -0.2554 -0.1732 -0.2300 0.0428 -0.2547 0.1026 0.0964 0.0976 0.1015 0.0853 0.0833 0.0814 0.0918 0.0641 0.1750 0.0932 0.0929 0.1188 0.1435 0.1418 0.1007 0.1035 0.1070 0.1431 0.1003 0.0924 0.1047 0.1155 0.1017 0.0997 0.0900 0.0911
va: 1.9452 2.1131 1.9712 2.1443 2.0155 3.2540 3.5559 3.9974 4.0392 3.8700 3.8101 3.8779 3.9532 3.2694 4.3563 3.3166 3.9051 3.8638 3.9232 4.2951 3.7898 3.8445 3.9185 3.9338 3.9136 3.8476 3.9215 1.0139 1.0167 1.0110 1.0171 1.0218 1.0255 1.0241 1.0148 1.0072 1.0135 0.9822 0.9908 0.9915 1.0210 0.9997 1.0048 1.0063 0.9932 0.9965 0.9965 1.0055 0.9937 0.9956 1.0046 1.0061 1.0118 1.0043
dispcorr: -0.029093124 hartree
energy: -1247.581772514166
dipole: 9.79564 -9.23580 0.55984 13.75706 -10.28542 3.47165 0.49963 0.52796 1.02760
magnitude: 3.66356 au
magnitude: 9.31204 debye
