program: Orca
programVersion: 5.0.2
elementType: O O O O O N C C C C C C C C C C C C C C C C C C C C C H H H H H H H H H H H H H H H H H H H H H H H H H H H
charge: 0
multiplicity: 1
keywords: wb97x-d3
keywords: def2-TZVPP
keywords: def2/J RIJCOSX
keywords: DEFGRID2
keywords: scfconv7
keywords: smallprint printgap noloewdin
keywords: NOSOSCF
formula: C21H27NO5
InChI: InChI=1/C21H27NO5/c1-5-26-20(24)27-18-17(16-12-13(2)6-7-14(16)3)19(23)22-21(18)10-8-15(25-4)9-11-21/h6-7,12,15,22H,5,8-11H2,1-4H3
54 atoms
O  5.939206 -0.006006 0.260352
O  -0.178118 1.065388 0.849268
O  0.012955 -3.247535 -1.080501
O  -1.20411 2.938094 0.89116
O  -0.629782 2.081593 -1.112846
N  1.612449 -1.701149 -0.502197
C  1.696131 -0.374009 0.074762
C  2.417551 -0.391197 1.430605
C  2.386808 0.618036 -0.871217
C  3.90595 -0.679915 1.276117
C  3.875075 0.318662 -1.016378
C  4.566105 0.32277 0.342856
C  0.235203 -0.083399 0.239615
C  -0.547596 -1.08368 -0.153717
C  0.353796 -2.156351 -0.641504
C  -2.012993 -1.189493 -0.0965
C  6.743059 1.001179 -0.310882
C  -2.61869 -1.986729 0.880857
C  -2.79392 -0.477534 -1.004557
C  -0.683345 2.050857 0.085659
C  -4.182811 -0.521619 -0.966971
C  -4.010162 -2.032727 0.910044
C  -1.806848 -2.7592 1.876948
C  -4.779796 -1.313638 0.00968
C  -5.012652 0.268157 -1.934343
C  -1.916237 4.046677 0.296027
C  -3.305487 3.644917 -0.134851
H  1.950528 -1.131342 2.083066
H  2.287468 0.584126 1.906253
H  2.261938 1.627226 -0.469236
H  1.898433 0.597406 -1.846394
H  4.377391 -0.639775 2.260491
H  4.061016 -1.693982 0.892674
H  4.025607 -0.653199 -1.498206
H  4.313098 1.068584 -1.678355
H  4.458538 1.328845 0.780519
H  2.426037 -2.248395 -0.740443
H  6.583099 1.972879 0.170228
H  7.784668 0.716455 -0.164627
H  6.575614 1.124274 -1.385154
H  -2.306645 0.121043 -1.763625
H  -4.500799 -2.639949 1.661141
H  -1.064942 -2.130194 2.371472
H  -2.443615 -3.191171 2.647803
H  -1.265673 -3.580969 1.404973
H  -5.860411 -1.370828 0.068078
H  -5.696875 -0.374948 -2.489002
H  -5.623578 1.010754 -1.418447
H  -4.391771 0.794554 -2.657636
H  -1.335478 4.45967 -0.528586
H  -1.954506 4.791563 1.087138
H  -3.879989 3.244467 0.699816
H  -3.297205 2.908091 -0.938117
H  -3.825883 4.529221 -0.50289
elementType: O N C H
totalener: -1247.55274674 hartree
nucrepener: 2636.94005576 hartree
electener: -3884.49280250 hartree
oneelecener: -6942.15986870 hartree
twoeener: 3057.66706619 hartree
cpcmener: -0.05215074 hartree
kineticenergy: 1242.08146667 hartree
xcener: -120.047346193365 hartree
chargesum: 0.0000000
charge: -0.397259 -0.318784 -0.547813 -0.289427 -0.459562 -0.212715 0.551197 -0.246170 -0.287678 -0.181725 -0.170204 0.177542 0.088003 0.131397 0.274625 0.019847 -0.113973 -0.164869 -0.240340 0.563674 -0.027095 -0.098953 -0.246192 -0.174173 -0.249375 0.048153 -0.249831 0.101547 0.096104 0.099066 0.101317 0.085127 0.082956 0.081684 0.091075 0.064284 0.173847 0.092593 0.118567 0.092790 0.142742 0.142309 0.105829 0.099943 0.100807 0.143515 0.112749 0.105149 0.096163 0.101096 0.114546 0.094206 0.078007 0.103681
qa: -0.3973 -0.3188 -0.5478 -0.2894 -0.4596 -0.2127 0.5512 -0.2462 -0.2877 -0.1817 -0.1702 0.1775 0.0880 0.1314 0.2746 0.0198 -0.1140 -0.1649 -0.2403 0.5637 -0.0271 -0.0990 -0.2462 -0.1742 -0.2494 0.0482 -0.2498 0.1015 0.0961 0.0991 0.1013 0.0851 0.0830 0.0817 0.0911 0.0643 0.1738 0.0926 0.1186 0.0928 0.1427 0.1423 0.1058 0.0999 0.1008 0.1435 0.1127 0.1051 0.0962 0.1011 0.1145 0.0942 0.0780 0.1037
va: 1.9446 2.1090 1.9700 2.1461 2.0245 3.2562 3.5404 4.0008 4.0360 3.8740 3.8071 3.8797 3.9604 3.2598 4.3593 3.3003 3.9054 3.8831 3.9112 4.3114 3.7634 3.8385 3.9238 3.9373 3.9099 3.8464 3.9171 1.0142 1.0159 1.0128 1.0175 1.0219 1.0252 1.0241 1.0147 1.0070 1.0138 0.9909 0.9915 0.9824 1.0211 0.9996 0.9933 1.0051 1.0057 0.9962 0.9974 0.9920 1.0029 1.0063 0.9964 1.0035 1.0110 1.0081
dispcorr: -0.030345595 hartree
energy: -1247.583092334963
dipole: 5.19454 -4.76019 0.43435 10.60255 -7.30225 3.30030 0.40287 0.66108 1.06395
magnitude: 3.49466 au
magnitude: 8.88271 debye
