program: Orca
programVersion: 5.0.2
elementType: O O O O O N C C C C C C C C C C C C C C C C C C C C C H H H H H H H H H H H H H H H H H H H H H H H H H H H
charge: 0
multiplicity: 1
keywords: wb97x-d3
keywords: def2-TZVPP
keywords: def2/J RIJCOSX
keywords: DEFGRID2
keywords: scfconv7
keywords: smallprint printgap noloewdin
keywords: NOSOSCF
formula: C21H27NO5
InChI: InChI=1/C21H27NO5/c1-5-26-20(24)27-18-17(16-12-13(2)6-7-14(16)3)19(23)22-21(18)10-8-15(25-4)9-11-21/h6-7,12,15,22H,5,8-11H2,1-4H3
54 atoms
O  6.044955 -0.184699 0.106882
O  0.047616 1.119263 0.889623
O  -0.016243 -3.062056 -1.339898
O  -1.227912 2.778886 1.320014
O  -1.264302 1.921692 -0.763016
N  1.649096 -1.633562 -0.661127
C  1.793127 -0.365266 0.022835
C  2.545558 -0.518864 1.352669
C  2.492788 0.680654 -0.855342
C  4.014801 -0.857343 1.13062
C  3.962514 0.335044 -1.070732
C  4.690972 0.192882 0.262992
C  0.350232 -0.029428 0.235846
C  -0.481781 -0.965604 -0.222125
C  0.370271 -2.024793 -0.815936
C  -1.946508 -1.015589 -0.203566
C  6.883801 0.846111 -0.362912
C  -2.675895 -0.9315 0.987208
C  -2.612405 -1.130982 -1.426973
C  -0.880019 1.95102 0.371009
C  -3.99616 -1.134047 -1.511826
C  -4.068686 -0.933325 0.893862
C  -2.030896 -0.840986 2.339435
C  -4.718321 -1.024671 -0.323388
C  -4.69917 -1.25427 -2.830791
C  -2.32431 3.681641 1.050319
C  -3.655156 2.974841 1.140659
H  2.060758 -1.286086 1.959423
H  2.471673 0.421967 1.90399
H  2.418554 1.654318 -0.363698
H  1.97484 0.764187 -1.81223
H  4.51508 -0.92066 2.09927
H  4.113194 -1.841221 0.659765
H  4.056831 -0.598276 -1.635673
H  4.417056 1.119076 -1.679971
H  4.639451 1.161021 0.787521
H  2.436695 -2.203643 -0.930701
H  6.668242 1.136284 -1.395979
H  6.814886 1.743753 0.262329
H  7.9103 0.481954 -0.324372
H  -2.029107 -1.194558 -2.338282
H  -4.654375 -0.865904 1.80311
H  -1.893868 0.195756 2.65383
H  -2.65937 -1.315111 3.092956
H  -1.055305 -1.325001 2.369601
H  -5.801733 -1.019551 -0.351946
H  -3.992854 -1.279457 -3.659506
H  -5.298303 -2.16507 -2.878767
H  -5.379156 -0.417604 -2.997243
H  -2.180783 4.161757 0.08215
H  -2.23384 4.44328 1.821013
H  -3.77873 2.484304 2.106229
H  -3.78979 2.235618 0.351578
H  -4.450081 3.71385 1.038786
elementType: O N C H
totalener: -1247.55355338 hartree
nucrepener: 2652.52287531 hartree
electener: -3900.07642869 hartree
oneelecener: -6973.53040930 hartree
twoeener: 3073.45398061 hartree
cpcmener: -0.05477856 hartree
kineticenergy: 1242.08234760 hartree
xcener: -120.050311689211 hartree
chargesum: 0.0000000
charge: -0.398524 -0.330623 -0.551274 -0.285439 -0.442451 -0.224111 0.567856 -0.245750 -0.271157 -0.184422 -0.169341 0.185099 0.070249 0.208392 0.252182 -0.057555 -0.112949 -0.102349 -0.202323 0.550741 -0.058950 -0.159727 -0.257778 -0.142241 -0.226958 0.043246 -0.254346 0.099825 0.095335 0.097548 0.098433 0.085402 0.081695 0.081383 0.090460 0.063125 0.173816 0.092228 0.092302 0.118143 0.131306 0.136756 0.098391 0.109401 0.110623 0.144397 0.092023 0.102955 0.102205 0.104233 0.115259 0.093648 0.080309 0.109303
qa: -0.3985 -0.3306 -0.5513 -0.2854 -0.4425 -0.2241 0.5679 -0.2458 -0.2712 -0.1844 -0.1693 0.1851 0.0702 0.2084 0.2522 -0.0576 -0.1129 -0.1023 -0.2023 0.5507 -0.0590 -0.1597 -0.2578 -0.1422 -0.2270 0.0432 -0.2543 0.0998 0.0953 0.0975 0.0984 0.0854 0.0817 0.0814 0.0905 0.0631 0.1738 0.0922 0.0923 0.1181 0.1313 0.1368 0.0984 0.1094 0.1106 0.1444 0.0920 0.1030 0.1022 0.1042 0.1153 0.0936 0.0803 0.1093
va: 1.9433 2.1127 1.9683 2.1457 2.0475 3.2651 3.4521 4.0005 4.0320 3.8815 3.7964 3.8704 3.9603 3.1415 4.3663 3.2968 3.9060 3.7127 3.9322 4.3313 3.8145 3.8768 3.9223 3.8795 3.9106 3.8386 3.9158 1.0150 1.0166 1.0133 1.0177 1.0219 1.0255 1.0248 1.0156 1.0067 1.0142 0.9821 0.9912 0.9914 1.0205 1.0029 1.0054 1.0017 1.0004 0.9951 1.0062 0.9940 0.9955 1.0062 0.9971 1.0025 1.0099 1.0092
dispcorr: -0.031193151 hartree
energy: -1247.584746534948
dipole: 4.90648 -4.34434 0.56213 8.79138 -5.60614 3.18524 2.54426 -1.02996 1.51430
magnitude: 3.57139 au
magnitude: 9.07776 debye
