program: Orca
programVersion: 5.0.2
elementType: O O O O O N C C C C C C C C C C C C C C C C C C C C C H H H H H H H H H H H H H H H H H H H H H H H H H H H
charge: 0
multiplicity: 1
keywords: wb97x-d3
keywords: def2-TZVPP
keywords: def2/J RIJCOSX
keywords: DEFGRID2
keywords: scfconv7
keywords: smallprint printgap noloewdin
keywords: NOSOSCF
formula: C21H27NO5
InChI: InChI=1/C21H27NO5/c1-5-26-20(24)27-18-17(16-12-13(2)6-7-14(16)3)19(23)22-21(18)10-8-15(25-4)9-11-21/h6-7,12,15,22H,5,8-11H2,1-4H3
54 atoms
O  6.044701 -0.02922 0.420441
O  0.00727 1.317884 0.387024
O  0.054498 -3.388374 -0.100707
O  -1.372439 2.936925 0.188895
O  -1.178481 1.489012 -1.526888
N  1.688647 -1.776974 -0.009026
C  1.802215 -0.344975 0.188025
C  2.482007 -0.007708 1.523123
C  2.547292 0.336848 -0.966981
C  3.965284 -0.35714 1.507332
C  4.029938 -0.021919 -0.971316
C  4.680409 0.339021 0.360444
C  0.351333 0.020795 0.194659
C  -0.458613 -1.028735 0.050883
C  0.416012 -2.219767 -0.037357
C  -1.926549 -1.046676 0.056079
C  6.898279 0.781009 -0.355875
C  -2.654072 -1.48217 -1.059181
C  -2.592204 -0.552704 1.176953
C  -0.904982 1.886698 -0.430193
C  -3.980051 -0.485592 1.23637
C  -4.042441 -1.41461 -0.99245
C  -1.981656 -1.968466 -2.307829
C  -4.696732 -0.927894 0.129296
C  -4.676739 0.036213 2.456674
C  -2.439937 3.675114 -0.451118
C  -3.769393 2.979426 -0.290642
H  1.974008 -0.533808 2.333405
H  2.367032 1.062547 1.712515
H  2.438563 1.419577 -0.86063
H  2.084352 0.060509 -1.915877
H  4.408996 -0.058864 2.459589
H  4.101612 -1.440447 1.421128
H  4.165151 -1.091561 -1.163499
H  4.510325 0.509039 -1.795835
H  4.589529 1.428255 0.503597
H  2.478754 -2.401069 0.060603
H  6.779833 1.844195 -0.116744
H  7.924784 0.493424 -0.128946
H  6.744669 0.657527 -1.432513
H  -2.010259 -0.21633 2.027879
H  -4.625681 -1.736965 -1.846896
H  -1.56891 -2.970235 -2.183818
H  -2.689705 -2.012001 -3.134624
H  -1.159857 -1.316064 -2.608404
H  -5.779465 -0.883128 0.136015
H  -5.593833 0.56492 2.197573
H  -4.95511 -0.777526 3.129794
H  -4.04078 0.718156 3.02019
H  -2.192575 3.849451 -1.498369
H  -2.437732 4.634314 0.060738
H  -4.55022 3.627677 -0.689163
H  -3.99685 2.79244 0.75906
H  -3.816041 2.035693 -0.833498
elementType: O N C H
totalener: -1247.55387794 hartree
nucrepener: 2657.05496570 hartree
electener: -3904.60884363 hartree
oneelecener: -6982.65609462 hartree
twoeener: 3078.04725099 hartree
cpcmener: -0.05245432 hartree
kineticenergy: 1242.08256019 hartree
xcener: -120.049541406938 hartree
chargesum: -0.0000000
charge: -0.397830 -0.326590 -0.548686 -0.283801 -0.443236 -0.220393 0.525874 -0.235026 -0.276640 -0.181003 -0.165510 0.179679 0.117750 0.123613 0.262662 -0.043977 -0.113970 -0.135291 -0.144193 0.545925 -0.102205 -0.113094 -0.255114 -0.136439 -0.235968 0.043881 -0.251526 0.101531 0.094209 0.098445 0.099921 0.086764 0.081372 0.081420 0.089952 0.063967 0.174297 0.092765 0.118423 0.092712 0.134596 0.140219 0.105940 0.100318 0.101043 0.142288 0.099772 0.113039 0.097287 0.104401 0.116111 0.108626 0.090001 0.081687
qa: -0.3978 -0.3266 -0.5487 -0.2838 -0.4432 -0.2204 0.5259 -0.2350 -0.2766 -0.1810 -0.1655 0.1797 0.1177 0.1236 0.2627 -0.0440 -0.1140 -0.1353 -0.1442 0.5459 -0.1022 -0.1131 -0.2551 -0.1364 -0.2360 0.0439 -0.2515 0.1015 0.0942 0.0984 0.0999 0.0868 0.0814 0.0814 0.0900 0.0640 0.1743 0.0928 0.1184 0.0927 0.1346 0.1402 0.1059 0.1003 0.1010 0.1423 0.0998 0.1130 0.0973 0.1044 0.1161 0.1086 0.0900 0.0817
va: 1.9439 2.1210 1.9676 2.1483 2.0460 3.2467 3.5381 4.0018 4.0351 3.8773 3.7969 3.8756 3.9378 3.1958 4.3564 3.3059 3.9057 3.8042 3.8309 4.3440 3.7782 3.8763 3.9161 3.8684 3.9028 3.8430 3.9149 1.0118 1.0158 1.0137 1.0172 1.0214 1.0256 1.0247 1.0157 1.0066 1.0144 0.9909 0.9914 0.9821 1.0143 0.9997 1.0082 1.0046 1.0009 0.9965 0.9986 0.9947 1.0014 1.0057 0.9961 1.0092 1.0018 1.0104
dispcorr: -0.031489534 hartree
energy: -1247.585367470550
dipole: 4.74121 -4.29704 0.44416 9.58130 -6.06702 3.51428 -0.48098 0.78434 0.30336
magnitude: 3.55520 au
magnitude: 9.03661 debye
