program: Orca
programVersion: 5.0.2
elementType: O O O O O N C C C C C C C C C C C C C C C C C C C C C H H H H H H H H H H H H H H H H H H H H H H H H H H H
charge: 0
multiplicity: 1
keywords: wb97x-d3
keywords: def2-TZVPP
keywords: def2/J RIJCOSX
keywords: DEFGRID2
keywords: scfconv7
keywords: smallprint printgap noloewdin
keywords: NOSOSCF
formula: C21H27NO5
InChI: InChI=1/C21H27NO5/c1-5-26-20(24)27-18-17(16-12-13(2)6-7-14(16)3)19(23)22-21(18)10-8-15(25-4)9-11-21/h6-7,12,15,22H,5,8-11H2,1-4H3
54 atoms
O  6.018124 0.040538 0.304699
O  0.10348 1.397031 -0.630822
O  -0.034183 -3.257346 0.23309
O  -1.436657 1.741567 0.911555
O  -1.448416 2.919455 -1.002346
N  1.620856 -1.666393 0.264948
C  1.782728 -0.261402 -0.049736
C  2.407332 0.523483 1.110809
C  2.614437 -0.063694 -1.32506
C  3.873569 0.159661 1.313939
C  4.07605 -0.434894 -1.106857
C  4.671459 0.378199 0.03814
C  0.350381 0.119065 -0.262136
C  -0.491077 -0.910121 -0.129703
C  0.347601 -2.096675 0.149906
C  -1.949022 -0.922665 -0.293947
C  6.929675 0.505235 -0.665339
C  -2.794341 -1.32354 0.751482
C  -2.49009 -0.44122 -1.483574
C  -1.010775 2.074941 -0.274009
C  -3.864569 -0.333398 -1.676643
C  -4.165863 -1.227924 0.546386
C  -2.264585 -1.793362 2.073612
C  -4.696114 -0.741892 -0.641196
C  -4.411134 0.220771 -2.957844
C  -2.669292 2.354675 1.362178
C  -2.964225 1.846735 2.747017
H  1.838086 0.343548 2.02441
H  2.330058 1.591315 0.890403
H  2.553275 0.985927 -1.623537
H  2.184152 -0.653502 -2.136502
H  4.282525 0.773829 2.119201
H  3.967184 -0.884028 1.6318
H  4.176447 -1.502738 -0.884671
H  4.618505 -0.257821 -2.037744
H  4.609196 1.445735 -0.229968
H  2.40259 -2.303174 0.310198
H  6.815438 0.007978 -1.633473
H  6.836555 1.585415 -0.827038
H  7.936092 0.300829 -0.300665
H  -1.820498 -0.142486 -2.283221
H  -4.837541 -1.52185 1.344236
H  -3.034587 -1.732106 2.841735
H  -1.934906 -2.832042 2.034528
H  -1.413949 -1.197092 2.407412
H  -5.771253 -0.670272 -0.754514
H  -5.495872 0.312013 -2.921983
H  -3.999627 1.209929 -3.164676
H  -4.158816 -0.413411 -3.80909
H  -3.466091 2.093028 0.664047
H  -2.545327 3.438011 1.361594
H  -3.883157 2.316555 3.09651
H  -2.17161 2.102619 3.449632
H  -3.116737 0.768665 2.763624
elementType: O N C H
totalener: -1247.55154227 hartree
nucrepener: 2677.24205413 hartree
electener: -3924.79359640 hartree
oneelecener: -7022.00117837 hartree
twoeener: 3097.20758197 hartree
cpcmener: -0.05162321 hartree
kineticenergy: 1242.08797909 hartree
xcener: -120.052073724600 hartree
chargesum: 0.0000000
charge: -0.398422 -0.308182 -0.547962 -0.248438 -0.435176 -0.222998 0.523836 -0.249012 -0.261780 -0.177700 -0.172326 0.184449 0.126329 0.128885 0.258190 0.000320 -0.113494 -0.178120 -0.188734 0.483090 -0.049165 -0.118956 -0.288709 -0.143358 -0.225165 0.007398 -0.256766 0.097982 0.096058 0.096179 0.103358 0.085562 0.082251 0.080368 0.090672 0.063039 0.173119 0.092436 0.092186 0.118837 0.147335 0.139102 0.106985 0.116927 0.109760 0.143219 0.092292 0.100281 0.106166 0.119835 0.127507 0.100818 0.096972 0.092722
qa: -0.3984 -0.3082 -0.5480 -0.2484 -0.4352 -0.2230 0.5238 -0.2490 -0.2618 -0.1777 -0.1723 0.1844 0.1263 0.1289 0.2582 0.0003 -0.1135 -0.1781 -0.1887 0.4831 -0.0492 -0.1190 -0.2887 -0.1434 -0.2252 0.0074 -0.2568 0.0980 0.0961 0.0962 0.1034 0.0856 0.0823 0.0804 0.0907 0.0630 0.1731 0.0924 0.0922 0.1188 0.1473 0.1391 0.1070 0.1169 0.1098 0.1432 0.0923 0.1003 0.1062 0.1198 0.1275 0.1008 0.0970 0.0927
va: 1.9435 2.1213 1.9688 2.1280 2.0670 3.2384 3.5414 4.0029 4.0315 3.8735 3.8030 3.8666 3.9360 3.1503 4.3545 3.3000 3.9057 3.7652 3.8515 4.4291 3.7860 3.8591 3.9016 3.8873 3.9125 3.7964 3.9532 1.0190 1.0163 1.0162 1.0093 1.0216 1.0254 1.0247 1.0162 1.0072 1.0159 0.9822 0.9912 0.9910 1.0096 1.0003 0.9988 1.0114 0.9936 0.9974 1.0045 0.9975 0.9950 0.9900 1.0012 1.0071 1.0046 0.9986
dispcorr: -0.032332514 hartree
energy: -1247.583874780283
dipole: 6.51589 -5.96659 0.54929 4.95463 -2.98143 1.97320 4.34501 -3.82560 0.51941
magnitude: 2.11306 au
magnitude: 5.37097 debye
