program: Orca
programVersion: 5.0.2
elementType: O O O O O N C C C C C C C C C C C C C C C C C C C C C H H H H H H H H H H H H H H H H H H H H H H H H H H H
charge: 0
multiplicity: 1
keywords: wb97x-d3
keywords: def2-TZVPP
keywords: def2/J RIJCOSX
keywords: DEFGRID2
keywords: scfconv7
keywords: smallprint printgap noloewdin
keywords: NOSOSCF
formula: C21H27NO5
InChI: InChI=1/C21H27NO5/c1-5-26-20(24)27-18-17(16-12-13(2)6-7-14(16)3)19(23)22-21(18)10-8-15(25-4)9-11-21/h6-7,12,15,22H,5,8-11H2,1-4H3
54 atoms
O  5.848107 0.241466 -0.052916
O  -0.3114 1.04107 0.69534
O  0.070521 -3.31077 -1.121917
O  -1.241538 2.964087 0.676266
O  -0.690327 2.032238 -1.296909
N  1.600615 -1.6906 -0.562966
C  1.626387 -0.335102 -0.050868
C  2.354761 -0.253958 1.299121
C  2.274913 0.633747 -1.049178
C  3.851314 -0.50349 1.148327
C  3.771472 0.381904 -1.188586
C  4.4701 0.478018 0.157849
C  0.153228 -0.104577 0.114858
C  -0.583518 -1.159323 -0.223561
C  0.363214 -2.202065 -0.692523
C  -2.039891 -1.338673 -0.150541
C  6.676779 0.65657 1.009221
C  -2.5958 -2.21435 0.789551
C  -2.864447 -0.618068 -1.012341
C  -0.751989 2.033194 -0.097744
C  -4.248652 -0.738433 -0.971548
C  -3.982553 -2.336549 0.820899
C  -1.743371 -2.986743 1.751407
C  -4.795545 -1.614685 -0.038499
C  -5.123922 0.039886 -1.907903
C  -1.814545 4.124546 0.030828
C  -2.332695 5.035898 1.110713
H  1.916213 -0.97163 1.995095
H  2.195752 0.74175 1.721174
H  2.119896 1.655832 -0.694008
H  1.782395 0.548494 -2.018649
H  4.317515 -0.410447 2.131512
H  4.036478 -1.527426 0.807056
H  3.95459 -0.604365 -1.628176
H  4.189823 1.116872 -1.879627
H  4.329581 1.498877 0.54881
H  2.433507 -2.185846 -0.845285
H  7.711507 0.53084 0.690693
H  6.520807 1.712436 1.258403
H  6.531374 0.068843 1.920961
H  -2.413718 0.04705 -1.738411
H  -4.43547 -3.002595 1.545651
H  -1.222191 -3.809608 1.25969
H  -0.982741 -2.357502 2.21649
H  -2.34953 -3.417989 2.546935
H  -5.871355 -1.730631 0.023549
H  -4.561327 0.810373 -2.433677
H  -5.57435 -0.609617 -2.660982
H  -5.942423 0.526152 -1.376151
H  -2.618367 3.801062 -0.631757
H  -1.046894 4.617239 -0.567095
H  -2.776689 5.913883 0.64288
H  -1.534558 5.377333 1.769424
H  -3.103266 4.552929 1.711085
elementType: O N C H
totalener: -1247.55361809 hartree
nucrepener: 2612.46662313 hartree
electener: -3860.02024122 hartree
oneelecener: -6893.17129867 hartree
twoeener: 3033.15105745 hartree
cpcmener: -0.05292867 hartree
kineticenergy: 1242.07336709 hartree
xcener: -120.045020085438 hartree
chargesum: 0.0000000
charge: -0.399199 -0.314295 -0.546941 -0.286282 -0.465598 -0.211240 0.552483 -0.267927 -0.266947 -0.171432 -0.184181 0.184308 0.092200 0.121628 0.273291 0.018525 -0.112942 -0.160685 -0.231865 0.574417 -0.032658 -0.101271 -0.255210 -0.171940 -0.229929 0.033514 -0.247948 0.101996 0.099018 0.095583 0.100686 0.089838 0.082530 0.082360 0.086082 0.063228 0.174716 0.118606 0.092527 0.091777 0.143874 0.141928 0.103440 0.106910 0.100883 0.142945 0.092248 0.104771 0.100186 0.109372 0.109388 0.091037 0.091100 0.091096
qa: -0.3992 -0.3143 -0.5469 -0.2863 -0.4656 -0.2112 0.5525 -0.2679 -0.2669 -0.1714 -0.1842 0.1843 0.0922 0.1216 0.2733 0.0185 -0.1129 -0.1607 -0.2319 0.5744 -0.0327 -0.1013 -0.2552 -0.1719 -0.2299 0.0335 -0.2479 0.1020 0.0990 0.0956 0.1007 0.0898 0.0825 0.0824 0.0861 0.0632 0.1747 0.1186 0.0925 0.0918 0.1439 0.1419 0.1034 0.1069 0.1009 0.1429 0.0922 0.1048 0.1002 0.1094 0.1094 0.0910 0.0911 0.0911
va: 1.9426 2.1126 1.9715 2.1487 2.0209 3.2521 3.5502 4.0272 4.0065 3.7887 3.8910 3.8725 3.9555 3.2735 4.3577 3.3277 3.9061 3.8633 3.9190 4.2904 3.7903 3.8458 3.9185 3.9332 3.9139 3.8337 3.9723 1.0125 1.0144 1.0141 1.0191 1.0162 1.0249 1.0252 1.0214 1.0068 1.0136 0.9911 0.9910 0.9823 1.0213 0.9997 1.0062 0.9932 1.0047 0.9964 1.0055 0.9937 0.9966 0.9929 0.9943 1.0061 1.0030 1.0033
dispcorr: -0.028717889 hartree
energy: -1247.582335975193
dipole: 7.14560 -6.61994 0.52566 12.09573 -8.94617 3.14956 6.51252 -4.62888 1.88363
magnitude: 3.70730 au
magnitude: 9.42322 debye
