program: Orca
programVersion: 5.0.2
elementType: O O O O O N C C C C C C C C C C C C C C C C C C C C C H H H H H H H H H H H H H H H H H H H H H H H H H H H
charge: 0
multiplicity: 1
keywords: wb97x-d3
keywords: def2-TZVPP
keywords: def2/J RIJCOSX
keywords: DEFGRID2
keywords: scfconv7
keywords: smallprint printgap noloewdin
keywords: NOSOSCF
formula: C21H27NO5
InChI: InChI=1/C21H27NO5/c1-5-26-20(24)27-18-17(16-12-13(2)6-7-14(16)3)19(23)22-21(18)10-8-15(25-4)9-11-21/h6-7,12,15,22H,5,8-11H2,1-4H3
54 atoms
O  5.954048 -0.03337 0.16539
O  -0.071614 1.036113 0.856553
O  0.017786 -3.158847 -1.35099
O  -1.235801 2.781909 1.229151
O  -1.401255 1.814657 -0.7953
N  1.624211 -1.677535 -0.647777
C  1.715217 -0.398993 0.020896
C  2.455681 -0.508194 1.361807
C  2.384776 0.661135 -0.865908
C  3.942652 -0.777937 1.16581
C  3.872291 0.380974 -1.052923
C  4.585836 0.289239 0.293212
C  0.257021 -0.106916 0.209173
C  -0.537802 -1.067161 -0.262748
C  0.359324 -2.108951 -0.832102
C  -2.000216 -1.17881 -0.275005
C  6.761763 1.014127 -0.310443
C  -2.754665 -1.16805 0.906703
C  -2.636154 -1.307837 -1.508281
C  -0.96931 1.884182 0.317805
C  -4.018161 -1.403851 -1.617546
C  -4.138149 -1.274348 0.790779
C  -2.130661 -1.051774 2.266634
C  -4.762059 -1.384608 -0.442085
C  -4.672488 -1.511832 -2.96287
C  -2.198009 3.802137 0.887596
C  -2.256804 4.773141 2.036339
H  2.000527 -1.296398 1.965063
H  2.328581 0.42918 1.90985
H  2.256992 1.642259 -0.399677
H  1.879012 0.699232 -1.832803
H  4.431331 -0.804043 2.142625
H  4.097023 -1.763386 0.712569
H  4.018866 -0.553961 -1.604525
H  4.300198 1.176858 -1.666818
H  4.483066 1.261796 0.803305
H  2.429652 -2.230604 -0.89809
H  6.563579 1.271701 -1.356471
H  6.647747 1.926081 0.288654
H  7.800616 0.690415 -0.238675
H  -2.035118 -1.311619 -2.410818
H  -4.742584 -1.276257 1.690478
H  -2.777386 -1.493962 3.024442
H  -1.164689 -1.553127 2.325022
H  -1.975267 -0.009819 2.555084
H  -5.842048 -1.463943 -0.487262
H  -4.535709 -0.598087 -3.544672
H  -4.249021 -2.328403 -3.549697
H  -5.744283 -1.687138 -2.874471
H  -3.167645 3.330332 0.717454
H  -1.890037 4.301298 -0.032548
H  -1.298053 5.266981 2.196322
H  -2.559979 4.286524 2.963769
H  -2.993844 5.543111 1.80839
elementType: O N C H
totalener: -1247.56216097 hartree
nucrepener: 2621.08135932 hartree
electener: -3868.64352030 hartree
oneelecener: -6910.47212460 hartree
twoeener: 3041.82860430 hartree
cpcmener: -0.04477334 hartree
kineticenergy: 1242.08267301 hartree
xcener: -120.045097736455 hartree
chargesum: -0.0000000
charge: -0.377088 -0.331868 -0.505135 -0.283875 -0.425264 -0.229341 0.551872 -0.245460 -0.274847 -0.182486 -0.169400 0.178149 0.079120 0.200818 0.227342 -0.044333 -0.114562 -0.124190 -0.192052 0.553817 -0.071597 -0.118468 -0.254980 -0.139820 -0.230756 0.032602 -0.246977 0.098222 0.093536 0.095776 0.099501 0.084299 0.080319 0.080793 0.088999 0.058977 0.169094 0.089514 0.089007 0.116648 0.124913 0.134507 0.104519 0.107621 0.099075 0.139356 0.103679 0.103567 0.090113 0.110049 0.106110 0.089752 0.090444 0.090389
qa: -0.3771 -0.3319 -0.5051 -0.2839 -0.4253 -0.2293 0.5519 -0.2455 -0.2748 -0.1825 -0.1694 0.1781 0.0791 0.2008 0.2273 -0.0443 -0.1146 -0.1242 -0.1921 0.5538 -0.0716 -0.1185 -0.2550 -0.1398 -0.2308 0.0326 -0.2470 0.0982 0.0935 0.0958 0.0995 0.0843 0.0803 0.0808 0.0890 0.0590 0.1691 0.0895 0.0890 0.1166 0.1249 0.1345 0.1045 0.1076 0.0991 0.1394 0.1037 0.1036 0.0901 0.1100 0.1061 0.0898 0.0904 0.0904
va: 1.9665 2.1121 2.0292 2.1425 2.0751 3.2501 3.4801 3.9967 4.0265 3.8816 3.7922 3.8844 3.9524 3.1186 4.3938 3.3002 3.9149 3.7711 3.9332 4.3215 3.8330 3.8898 3.9292 3.8986 3.9185 3.8331 3.9737 1.0159 1.0171 1.0131 1.0181 1.0224 1.0259 1.0252 1.0158 1.0068 1.0174 0.9819 0.9910 0.9918 1.0201 1.0020 1.0033 0.9989 1.0026 0.9989 0.9937 0.9953 1.0045 0.9933 0.9963 1.0032 1.0032 1.0063
dispcorr: -0.029003226 hartree
energy: -1247.591164199740
dipole: 7.64929 -6.95009 0.69920 12.66694 -9.46969 3.19726 4.05553 -2.72915 1.32638
magnitude: 3.53138 au
magnitude: 8.97604 debye
