program: Orca
programVersion: 5.0.2
elementType: O O O O O N C C C C C C C C C C C C C C C C C C C C C H H H H H H H H H H H H H H H H H H H H H H H H H H H
charge: 0
multiplicity: 1
keywords: wb97x-d3
keywords: def2-TZVPP
keywords: def2/J RIJCOSX
keywords: DEFGRID2
keywords: scfconv7
keywords: smallprint printgap noloewdin
keywords: NOSOSCF
formula: C21H27NO5
InChI: InChI=1/C21H27NO5/c1-5-26-20(24)27-18-17(16-12-13(2)6-7-14(16)3)19(23)22-21(18)10-8-15(25-4)9-11-21/h6-7,12,15,22H,5,8-11H2,1-4H3
54 atoms
O  5.243462 0.425139 -0.331305
O  0.299194 1.014622 -0.337096
O  -0.178875 -3.678019 -0.00641
O  -0.867928 2.77938 -0.058916
O  -0.846042 1.248779 1.593749
N  1.62516 -2.258435 0.002255
C  1.921858 -0.847331 -0.12903
C  2.703972 -0.344938 1.09823
C  2.713814 -0.590986 -1.423519
C  3.252844 1.069311 0.944227
C  3.255852 0.829935 -1.541521
C  4.080642 1.233161 -0.328208
C  0.516762 -0.314145 -0.179052
C  -0.412416 -1.268076 -0.106446
C  0.310993 -2.560124 -0.025376
C  -1.87067 -1.111271 -0.170281
C  6.231078 0.807309 0.59151
C  -2.69384 -1.512611 0.890095
C  -2.425842 -0.498005 -1.292492
C  -0.530299 1.654441 0.513379
C  -3.794563 -0.280699 -1.409663
C  -4.063022 -1.299894 0.763303
C  -2.135583 -2.115311 2.144441
C  -4.607415 -0.69783 -0.361138
C  -4.371661 0.371387 -2.630813
C  -1.825663 3.617551 0.621425
C  -3.236535 3.109865 0.4414
H  3.536046 -1.037481 1.251799
H  2.073329 -0.419253 1.987047
H  2.090309 -0.838015 -2.28479
H  3.548546 -1.295681 -1.435771
H  2.448095 1.807304 0.922116
H  3.843874 1.317986 1.828758
H  3.865156 0.906182 -2.445261
H  2.443955 1.54882 -1.663525
H  4.372576 2.289437 -0.42614
H  2.347712 -2.961081 -0.038473
H  5.947401 0.622645 1.633411
H  7.124709 0.218296 0.381779
H  6.494118 1.868373 0.497805
H  -1.771071 -0.191652 -2.100971
H  -4.718567 -1.596046 1.573948
H  -1.851133 -3.158434 2.002253
H  -1.247439 -1.58313 2.491019
H  -2.870759 -2.088419 2.948153
H  -5.678801 -0.54215 -0.415364
H  -4.652678 -0.370912 -3.381701
H  -5.269086 0.942609 -2.392746
H  -3.657611 1.048842 -3.09933
H  -1.700813 4.592858 0.155454
H  -1.558292 3.710694 1.675035
H  -3.49576 3.021311 -0.614446
H  -3.925796 3.824566 0.892561
H  -3.39828 2.146514 0.925186
elementType: O N C H
totalener: -1247.55833406 hartree
nucrepener: 2702.87760014 hartree
electener: -3950.43593420 hartree
oneelecener: -7074.57739736 hartree
twoeener: 3124.14146316 hartree
cpcmener: -0.03994149 hartree
kineticenergy: 1242.08439829 hartree
xcener: -120.047441444423 hartree
chargesum: -0.0000000
charge: -0.396442 -0.325280 -0.505174 -0.285167 -0.419224 -0.212782 0.551740 -0.246390 -0.216426 -0.213605 -0.205194 0.192085 0.047322 0.107446 0.252837 -0.027230 -0.119325 -0.127358 -0.155125 0.534373 -0.095063 -0.114550 -0.259707 -0.130582 -0.235604 0.040941 -0.252964 0.099914 0.097672 0.099737 0.096395 0.094607 0.096077 0.083334 0.089737 0.091690 0.159605 0.087611 0.116880 0.090370 0.130796 0.135524 0.109800 0.100267 0.097764 0.138666 0.111529 0.096797 0.096026 0.113585 0.101815 0.088766 0.106499 0.084988
qa: -0.3964 -0.3253 -0.5052 -0.2852 -0.4192 -0.2128 0.5517 -0.2464 -0.2164 -0.2136 -0.2052 0.1921 0.0473 0.1074 0.2528 -0.0272 -0.1193 -0.1274 -0.1551 0.5344 -0.0951 -0.1146 -0.2597 -0.1306 -0.2356 0.0409 -0.2530 0.0999 0.0977 0.0997 0.0964 0.0946 0.0961 0.0833 0.0897 0.0917 0.1596 0.0876 0.1169 0.0904 0.1308 0.1355 0.1098 0.1003 0.0978 0.1387 0.1115 0.0968 0.0960 0.1136 0.1018 0.0888 0.1065 0.0850
va: 1.9560 2.1062 2.0254 2.1392 2.0760 3.2072 3.4788 3.9884 3.9649 3.8883 3.9206 3.8817 4.0524 3.2105 4.3792 3.2846 3.9261 3.8139 3.8438 4.3487 3.7857 3.8856 3.9163 3.8755 3.9065 3.8501 3.9156 1.0135 1.0229 1.0131 1.0226 1.0237 1.0080 1.0247 1.0207 1.0029 1.0248 0.9808 0.9918 0.9916 1.0157 1.0011 1.0076 1.0009 1.0049 0.9971 0.9940 1.0000 1.0013 0.9957 1.0062 1.0022 1.0094 1.0107
dispcorr: -0.032572753 hartree
energy: -1247.590906811840
dipole: 4.01881 -3.07832 0.94049 12.81608 -9.58338 3.23270 1.12804 -1.18229 -0.05425
magnitude: 3.36717 au
magnitude: 8.55867 debye
