program: Orca
programVersion: 5.0.2
elementType: O O O O O N C C C C C C C C C C C C C C C C C C C C C H H H H H H H H H H H H H H H H H H H H H H H H H H H
charge: 0
multiplicity: 1
keywords: wb97x-d3
keywords: def2-TZVPP
keywords: def2/J RIJCOSX
keywords: DEFGRID2
keywords: scfconv7
keywords: smallprint printgap noloewdin
keywords: NOSOSCF
formula: C21H27NO5
InChI: InChI=1/C21H27NO5/c1-5-26-20(24)27-18-17(16-12-13(2)6-7-14(16)3)19(23)22-21(18)10-8-15(25-4)9-11-21/h6-7,12,15,22H,5,8-11H2,1-4H3
54 atoms
O  5.961517 -0.067459 -0.016892
O  0.010275 1.025259 1.181691
O  -0.102346 -2.95766 -1.389544
O  -1.373704 1.828412 -0.332964
O  -1.342011 2.661846 1.755088
N  1.564854 -1.549008 -0.677633
C  1.71806 -0.339684 0.102182
C  2.54309 -0.588633 1.373752
C  2.348422 0.793769 -0.718558
C  4.006357 -0.865536 1.04998
C  3.814056 0.5112 -1.033613
C  4.615673 0.270224 0.242609
C  0.279581 -0.059687 0.417899
C  -0.55369 -0.982959 -0.06388
C  0.287065 -1.963963 -0.797812
C  -2.013157 -1.081847 0.033941
C  6.770178 1.007599 -0.42495
C  -2.671267 -1.12716 1.269035
C  -2.749593 -1.115538 -1.152092
C  -0.970728 1.90598 0.904609
C  -4.13654 -1.165589 -1.155885
C  -4.064731 -1.181885 1.257381
C  -1.947647 -1.121472 2.584229
C  -4.785962 -1.19367 0.076422
C  -4.906123 -1.21155 -2.441931
C  -2.474627 2.668413 -0.744428
C  -2.024904 4.068318 -1.078578
H  2.110128 -1.423802 1.92831
H  2.476696 0.292626 2.017523
H  2.2737 1.723734 -0.147943
H  1.781689 0.937978 -1.640555
H  4.559417 -0.997713 1.982741
H  4.102864 -1.803424 0.492515
H  3.90203 -0.363371 -1.687418
H  4.218492 1.359142 -1.591115
H  4.576674 1.18843 0.852269
H  2.343953 -2.074447 -1.04407
H  6.502819 1.399772 -1.412217
H  6.738657 1.840257 0.288537
H  7.797993 0.64688 -0.478104
H  -2.222623 -1.075137 -2.09871
H  -4.596424 -1.218106 2.201191
H  -0.958175 -1.5730 2.518817
H  -1.821609 -0.109488 2.975325
H  -2.513424 -1.676285 3.332884
H  -5.868636 -1.2300 0.114212
H  -5.103277 -2.241932 -2.746712
H  -5.871954 -0.714174 -2.349885
H  -4.35904 -0.734545 -3.255153
H  -3.246303 2.659395 0.026325
H  -2.872542 2.167543 -1.624652
H  -1.255975 4.064521 -1.851542
H  -1.646608 4.604101 -0.208811
H  -2.879391 4.626263 -1.463958
elementType: O N C H
totalener: -1247.55870126 hartree
nucrepener: 2660.15929229 hartree
electener: -3907.71799355 hartree
oneelecener: -6987.82829056 hartree
twoeener: 3080.11029701 hartree
cpcmener: -0.04296871 hartree
kineticenergy: 1242.08335799 hartree
xcener: -120.047762330274 hartree
chargesum: -0.0000000
charge: -0.377961 -0.313764 -0.506866 -0.253165 -0.425304 -0.230800 0.562070 -0.245666 -0.267125 -0.185006 -0.173516 0.181659 0.051592 0.229593 0.225473 -0.026442 -0.114201 -0.124628 -0.253605 0.503494 -0.043213 -0.112810 -0.254867 -0.147996 -0.227587 0.029745 -0.243489 0.098427 0.094092 0.096355 0.097926 0.084677 0.080846 0.080540 0.088878 0.058567 0.168760 0.089295 0.089440 0.116364 0.122930 0.135336 0.106515 0.102248 0.107359 0.139848 0.106766 0.095093 0.093714 0.105019 0.106588 0.089988 0.090963 0.097850
qa: -0.3780 -0.3138 -0.5069 -0.2532 -0.4253 -0.2308 0.5621 -0.2457 -0.2671 -0.1850 -0.1735 0.1817 0.0516 0.2296 0.2255 -0.0264 -0.1142 -0.1246 -0.2536 0.5035 -0.0432 -0.1128 -0.2549 -0.1480 -0.2276 0.0297 -0.2435 0.0984 0.0941 0.0964 0.0979 0.0847 0.0808 0.0805 0.0889 0.0586 0.1688 0.0893 0.0894 0.1164 0.1229 0.1353 0.1065 0.1022 0.1074 0.1398 0.1068 0.0951 0.0937 0.1050 0.1066 0.0900 0.0910 0.0979
va: 1.9660 2.1110 2.0271 2.1247 2.0864 3.2542 3.4637 3.9934 4.0245 3.8812 3.7938 3.8842 3.9559 3.0483 4.3970 3.2757 3.9148 3.7706 3.9329 4.3957 3.7835 3.8939 3.9216 3.9119 3.9131 3.8185 3.9424 1.0161 1.0178 1.0139 1.0179 1.0225 1.0261 1.0252 1.0158 1.0067 1.0179 0.9817 0.9910 0.9919 1.0231 1.0012 1.0011 1.0032 1.0021 0.9975 0.9922 1.0007 1.0017 1.0042 0.9953 1.0032 1.0130 1.0067
dispcorr: -0.030975162 hartree
energy: -1247.589676425396
dipole: 7.88700 -7.32242 0.56458 9.99556 -7.79535 2.20022 -4.63382 4.04570 -0.58812
magnitude: 2.34640 au
magnitude: 5.96407 debye
