program: Orca
programVersion: 5.0.2
elementType: O O O O O N C C C C C C C C C C C C C C C C C C C C C H H H H H H H H H H H H H H H H H H H H H H H H H H H
charge: 0
multiplicity: 1
keywords: wb97x-d3
keywords: def2-TZVPP
keywords: def2/J RIJCOSX
keywords: DEFGRID2
keywords: scfconv7
keywords: smallprint printgap noloewdin
keywords: NOSOSCF
formula: C21H27NO5
InChI: InChI=1/C21H27NO5/c1-5-26-20(24)27-18-17(16-12-13(2)6-7-14(16)3)19(23)22-21(18)10-8-15(25-4)9-11-21/h6-7,12,15,22H,5,8-11H2,1-4H3
54 atoms
O  5.929383 0.152603 -0.40071
O  0.019963 1.066315 1.141931
O  -0.095564 -2.910066 -1.442736
O  -1.427502 1.843291 -0.327475
O  -1.342102 2.679515 1.758317
N  1.56539 -1.479216 -0.763621
C  1.718186 -0.265553 0.008344
C  2.591962 -0.491733 1.250945
C  2.297382 0.87899 -0.834628
C  4.047319 -0.749384 0.874902
C  3.7549 0.623735 -1.200999
C  4.609136 0.39526 0.036648
C  0.284387 -0.013388 0.368054
C  -0.545679 -0.950659 -0.092214
C  0.291663 -1.91292 -0.855506
C  -1.999571 -1.081515 0.043487
C  6.909501 0.252027 0.602171
C  -2.625812 -1.143072 1.295073
C  -2.763659 -1.142791 -1.123473
C  -0.986802 1.928282 0.897279
C  -4.148325 -1.235459 -1.092577
C  -4.016255 -1.243611 1.318224
C  -1.868971 -1.116434 2.591243
C  -4.765828 -1.283392 0.15503
C  -4.948959 -1.252242 -2.360709
C  -2.551072 2.669478 -0.703586
C  -2.128858 4.074216 -1.05418
H  2.194449 -1.329345 1.827827
H  2.535035 0.393271 1.890659
H  2.224293 1.807873 -0.262233
H  1.695868 1.010677 -1.736293
H  4.624104 -0.878486 1.793548
H  4.138879 -1.686377 0.315035
H  3.832148 -0.244795 -1.864146
H  4.137416 1.479948 -1.761458
H  4.585703 1.313027 0.647967
H  2.342083 -1.982833 -1.164395
H  7.885027 0.187668 0.118966
H  6.856914 1.208841 1.136186
H  6.851636 -0.551373 1.344676
H  -2.261326 -1.095799 -2.083255
H  -4.522361 -1.301291 2.275078
H  -1.747806 -0.099948 2.971921
H  -2.406473 -1.674121 3.358306
H  -0.874702 -1.553666 2.503158
H  -5.84495 -1.363079 0.219415
H  -4.406713 -1.737618 -3.172332
H  -5.896414 -1.775153 -2.23026
H  -5.183645 -0.237866 -2.69212
H  -3.297057 2.653377 0.091612
H  -2.971633 2.162598 -1.569458
H  -1.731989 4.616684 -0.197154
H  -3.001311 4.620324 -1.414529
H  -1.383493 4.078509 -1.849455
elementType: O N C H
totalener: -1247.55881510 hartree
nucrepener: 2658.85132245 hartree
electener: -3906.41013755 hartree
oneelecener: -6985.22416418 hartree
twoeener: 3078.81402664 hartree
cpcmener: -0.04289150 hartree
kineticenergy: 1242.07841202 hartree
xcener: -120.046884711674 hartree
chargesum: 0.0000000
charge: -0.377013 -0.314008 -0.506816 -0.253000 -0.424584 -0.230923 0.564794 -0.262218 -0.249096 -0.178611 -0.182000 0.178363 0.052193 0.228812 0.224635 -0.027373 -0.115144 -0.125648 -0.252925 0.503530 -0.041860 -0.112700 -0.254133 -0.148716 -0.226135 0.029573 -0.243765 0.098186 0.095701 0.093955 0.098076 0.089468 0.081035 0.080292 0.084938 0.059646 0.168880 0.116696 0.089082 0.090077 0.122512 0.135150 0.102143 0.107029 0.106525 0.139134 0.098702 0.095556 0.101275 0.105080 0.106537 0.091035 0.097920 0.090138
qa: -0.3770 -0.3140 -0.5068 -0.2530 -0.4246 -0.2309 0.5648 -0.2622 -0.2491 -0.1786 -0.1820 0.1784 0.0522 0.2288 0.2246 -0.0274 -0.1151 -0.1256 -0.2529 0.5035 -0.0419 -0.1127 -0.2541 -0.1487 -0.2261 0.0296 -0.2438 0.0982 0.0957 0.0940 0.0981 0.0895 0.0810 0.0803 0.0849 0.0596 0.1689 0.1167 0.0891 0.0901 0.1225 0.1352 0.1021 0.1070 0.1065 0.1391 0.0987 0.0956 0.1013 0.1051 0.1065 0.0910 0.0979 0.0901
va: 1.9673 2.1106 2.0271 2.1248 2.0871 3.2548 3.4591 4.0231 3.9954 3.7980 3.8745 3.8884 3.9544 3.0469 4.3971 3.2679 3.9150 3.7750 3.9335 4.3948 3.7861 3.8948 3.9209 3.9149 3.9126 3.8197 3.9416 1.0143 1.0165 1.0156 1.0191 1.0158 1.0247 1.0267 1.0219 1.0066 1.0178 0.9919 0.9910 0.9818 1.0244 1.0015 1.0035 1.0023 1.0008 0.9985 1.0008 1.0017 0.9930 1.0043 0.9951 1.0129 1.0068 1.0033
dispcorr: -0.030934962 hartree
energy: -1247.589750059515
dipole: 8.08092 -7.46871 0.61221 7.83692 -6.08027 1.75665 -1.46730 1.58961 0.12231
magnitude: 1.86429 au
magnitude: 4.73864 debye
