program: Orca
programVersion: 5.0.2
elementType: O O O O O N C C C C C C C C C C C C C C C C C C C C C H H H H H H H H H H H H H H H H H H H H H H H H H H H
charge: 0
multiplicity: 1
keywords: wb97x-d3
keywords: def2-TZVPP
keywords: def2/J RIJCOSX
keywords: DEFGRID2
keywords: scfconv7
keywords: smallprint printgap noloewdin
keywords: NOSOSCF
formula: C21H27NO5
InChI: InChI=1/C21H27NO5/c1-5-26-20(24)27-18-17(16-12-13(2)6-7-14(16)3)19(23)22-21(18)10-8-15(25-4)9-11-21/h6-7,12,15,22H,5,8-11H2,1-4H3
54 atoms
O  6.031623 -0.020768 0.421722
O  -0.008834 1.303824 0.397418
O  0.066285 -3.397878 -0.115645
O  -1.360682 2.941076 0.190769
O  -1.170194 1.497173 -1.527808
N  1.689412 -1.776354 -0.013715
C  1.793995 -0.345657 0.186571
C  2.471274 -0.006051 1.522478
C  2.535122 0.340042 -0.969249
C  3.956065 -0.348615 1.507535
C  4.020302 -0.008972 -0.972487
C  4.67078 0.349231 0.360854
C  0.340177 0.011584 0.194224
C  -0.463384 -1.041629 0.045307
C  0.417704 -2.231378 -0.047249
C  -1.931127 -1.063208 0.055639
C  6.891922 0.782906 -0.346541
C  -2.663371 -1.499086 -1.05631
C  -2.592174 -0.575134 1.181519
C  -0.90303 1.886239 -0.428526
C  -3.979794 -0.514313 1.250226
C  -4.05138 -1.438185 -0.980471
C  -1.993168 -1.979163 -2.308166
C  -4.700942 -0.956975 0.14641
C  -4.669983 -0.000821 2.47793
C  -2.399329 3.703705 -0.460831
C  -3.747281 3.038312 -0.326657
H  1.964513 -0.536025 2.331803
H  2.351108 1.063541 1.714959
H  2.418085 1.42287 -0.869328
H  2.074417 0.054966 -1.917225
H  4.400138 -0.04899 2.459655
H  4.09852 -1.431492 1.42309
H  4.161903 -1.076994 -1.170479
H  4.498772 0.527367 -1.795077
H  4.578629 1.438769 0.506312
H  2.478912 -2.400084 0.060919
H  6.788501 1.847292 -0.101616
H  7.915555 0.482037 -0.120973
H  6.741001 0.66966 -1.425526
H  -2.006204 -0.241844 2.031177
H  -4.639677 -1.761681 -1.831257
H  -1.545797 -2.964577 -2.177233
H  -2.708578 -2.054876 -3.126196
H  -1.198209 -1.303118 -2.626739
H  -5.784141 -0.918801 0.159635
H  -5.58898 0.530272 2.228834
H  -4.943724 -0.817995 3.149193
H  -4.031749 0.679644 3.041449
H  -2.133284 3.878807 -1.503976
H  -2.385041 4.661291 0.05541
H  -4.507817 3.705282 -0.734597
H  -3.996977 2.851504 0.718234
H  -3.805583 2.098966 -0.875535
elementType: O N C H
totalener: -1247.56135955 hartree
nucrepener: 2654.87625296 hartree
electener: -3902.43761250 hartree
oneelecener: -6978.17849313 hartree
twoeener: 3075.74088062 hartree
cpcmener: -0.04172618 hartree
kineticenergy: 1242.09576518 hartree
xcener: -120.048557639789 hartree
chargesum: -0.0000000
charge: -0.376756 -0.326811 -0.503847 -0.281059 -0.420001 -0.226083 0.527297 -0.237034 -0.278463 -0.179349 -0.168123 0.174685 0.110279 0.120768 0.239059 -0.027657 -0.115151 -0.130251 -0.153268 0.528693 -0.091286 -0.109570 -0.253954 -0.136944 -0.235170 0.042331 -0.252360 0.100902 0.091953 0.096473 0.099804 0.085557 0.079514 0.081195 0.088381 0.059608 0.169230 0.089548 0.116609 0.089825 0.131340 0.136299 0.108446 0.096446 0.100111 0.138684 0.097668 0.112019 0.095166 0.102036 0.113460 0.106112 0.088685 0.084956
qa: -0.3768 -0.3268 -0.5038 -0.2811 -0.4200 -0.2261 0.5273 -0.2370 -0.2785 -0.1793 -0.1681 0.1747 0.1103 0.1208 0.2391 -0.0277 -0.1152 -0.1303 -0.1533 0.5287 -0.0913 -0.1096 -0.2540 -0.1369 -0.2352 0.0423 -0.2524 0.1009 0.0920 0.0965 0.0998 0.0856 0.0795 0.0812 0.0884 0.0596 0.1692 0.0895 0.1166 0.0898 0.1313 0.1363 0.1084 0.0964 0.1001 0.1387 0.0977 0.1120 0.0952 0.1020 0.1135 0.1061 0.0887 0.0850
va: 1.9670 2.1193 2.0258 2.1484 2.0746 3.2330 3.5337 3.9985 4.0315 3.8763 3.7945 3.8894 3.9390 3.1917 4.3841 3.3066 3.9145 3.8222 3.8417 4.3662 3.7821 3.8786 3.9144 3.8809 3.9049 3.8497 3.9141 1.0123 1.0164 1.0137 1.0182 1.0220 1.0265 1.0251 1.0159 1.0065 1.0180 0.9908 0.9920 0.9818 1.0148 1.0009 1.0084 1.0055 1.0011 0.9973 0.9990 0.9942 1.0019 1.0058 0.9959 1.0094 1.0023 1.0105
dispcorr: -0.031277764 hartree
energy: -1247.592637310931
dipole: 4.81407 -4.39151 0.42256 9.74402 -6.47045 3.27357 -0.49383 0.76209 0.26825
magnitude: 3.31161 au
magnitude: 8.41745 debye
