program: Orca
programVersion: 5.0.2
elementType: O O O O O N C C C C C C C C C C C C C C C C C C C C C H H H H H H H H H H H H H H H H H H H H H H H H H H H
charge: 0
multiplicity: 1
keywords: wb97x-d3
keywords: def2-TZVPP
keywords: def2/J RIJCOSX
keywords: DEFGRID2
keywords: scfconv7
keywords: smallprint printgap noloewdin
keywords: NOSOSCF
formula: C21H27NO5
InChI: InChI=1/C21H27NO5/c1-5-26-20(24)27-18-17(16-12-13(2)6-7-14(16)3)19(23)22-21(18)10-8-15(25-4)9-11-21/h6-7,12,15,22H,5,8-11H2,1-4H3
54 atoms
O  6.00117 -0.047853 -0.080297
O  0.055239 1.36937 -0.771539
O  -0.065919 -3.260239 0.225946
O  -1.357521 1.737678 0.882249
O  -1.443471 2.968138 -0.995454
N  1.600888 -1.68691 0.092045
C  1.754915 -0.283469 -0.224391
C  2.401642 0.493878 0.930376
C  2.561197 -0.076954 -1.514496
C  3.86935 0.120524 1.107804
C  4.03003 -0.437085 -1.327536
C  4.65092 0.348582 -0.182726
C  0.315313 0.098066 -0.392636
C  -0.522975 -0.923646 -0.205227
C  0.319196 -2.112401 0.072312
C  -1.9864 -0.931599 -0.311868
C  6.808178 0.808815 0.688423
C  -2.79522 -1.288901 0.777022
C  -2.567911 -0.505592 -1.503683
C  -0.996394 2.0868 -0.321903
C  -3.948467 -0.419979 -1.660591
C  -4.173128 -1.203683 0.613132
C  -2.223978 -1.724938 2.093802
C  -4.743657 -0.778983 -0.579163
C  -4.539239 0.053083 -2.955041
C  -2.502403 2.417234 1.446772
C  -2.658516 1.961161 2.871707
H  1.845487 0.306914 1.851312
H  2.323894 1.564559 0.721264
H  2.483795 0.971666 -1.813358
H  2.121475 -0.671939 -2.317726
H  4.281842 0.718515 1.923724
H  3.964947 -0.928235 1.40941
H  4.14033 -1.51011 -1.136378
H  4.567767 -0.228761 -2.255419
H  4.600072 1.42221 -0.430208
H  2.380124 -2.323495 0.164235
H  7.841162 0.476579 0.579291
H  6.747631 1.848961 0.345057
H  6.563099 0.791508 1.755834
H  -1.924933 -0.239778 -2.336241
H  -4.818556 -1.463093 1.444395
H  -1.29849 -1.202418 2.338063
H  -2.930316 -1.540318 2.90276
H  -2.004065 -2.793484 2.101068
H  -5.822731 -0.720781 -0.66129
H  -4.18226 1.05192 -3.212477
H  -4.267603 -0.604688 -3.782548
H  -5.62703 0.09246 -2.907821
H  -3.384275 2.174804 0.851423
H  -2.337926 3.494498 1.398958
H  -1.768916 2.177113 3.463683
H  -2.877645 0.896435 2.940524
H  -3.493284 2.501146 3.318591
elementType: O N C H
totalener: -1247.55917651 hartree
nucrepener: 2672.92268622 hartree
electener: -3920.48186273 hartree
oneelecener: -7013.34121101 hartree
twoeener: 3092.85934828 hartree
cpcmener: -0.04195158 hartree
kineticenergy: 1242.08757697 hartree
xcener: -120.048344262105 hartree
chargesum: 0.0000000
charge: -0.376725 -0.307626 -0.504193 -0.248655 -0.413094 -0.226731 0.526805 -0.275226 -0.239154 -0.169237 -0.182385 0.177786 0.110669 0.144589 0.236622 0.009809 -0.115203 -0.185981 -0.190771 0.472471 -0.043786 -0.106792 -0.292923 -0.145778 -0.225663 0.014267 -0.259219 0.098631 0.096732 0.092568 0.101115 0.088575 0.080507 0.080247 0.085192 0.059473 0.168410 0.116879 0.089537 0.089458 0.139691 0.135963 0.105785 0.104193 0.120645 0.139355 0.101737 0.105074 0.090007 0.116192 0.120912 0.093211 0.096802 0.099234
qa: -0.3767 -0.3076 -0.5042 -0.2487 -0.4131 -0.2267 0.5268 -0.2752 -0.2392 -0.1692 -0.1824 0.1778 0.1107 0.1446 0.2366 0.0098 -0.1152 -0.1860 -0.1908 0.4725 -0.0438 -0.1068 -0.2929 -0.1458 -0.2257 0.0143 -0.2592 0.0986 0.0967 0.0926 0.1011 0.0886 0.0805 0.0802 0.0852 0.0595 0.1684 0.1169 0.0895 0.0895 0.1397 0.1360 0.1058 0.1042 0.1206 0.1394 0.1017 0.1051 0.0900 0.1162 0.1209 0.0932 0.0968 0.0992
va: 1.9670 2.1194 2.0270 2.1218 2.0986 3.2336 3.5217 4.0329 3.9976 3.7891 3.8822 3.8858 3.9310 3.1236 4.3858 3.2873 3.9146 3.7826 3.8728 4.4399 3.8010 3.8663 3.9127 3.9002 3.9139 3.8020 3.9572 1.0164 1.0145 1.0181 1.0126 1.0161 1.0255 1.0259 1.0222 1.0068 1.0184 0.9919 0.9910 0.9819 1.0112 1.0004 0.9953 0.9976 1.0086 0.9988 0.9962 0.9950 1.0051 0.9919 1.0019 1.0052 0.9972 1.0075
dispcorr: -0.031957132 hartree
energy: -1247.591133643082
dipole: 6.93064 -6.35321 0.57743 5.95157 -3.95873 1.99284 8.70601 -7.33970 1.36632
magnitude: 2.48428 au
magnitude: 6.31454 debye
