program: Orca
programVersion: 5.0.2
elementType: O O O O O N C C C C C C C C C C C C C C C C C C C C C H H H H H H H H H H H H H H H H H H H H H H H H H H H
charge: 0
multiplicity: 1
keywords: wb97x-d3
keywords: def2-TZVPP
keywords: def2/J RIJCOSX
keywords: DEFGRID2
keywords: scfconv7
keywords: smallprint printgap noloewdin
keywords: NOSOSCF
formula: C21H27NO5
InChI: InChI=1/C21H27NO5/c1-5-26-20(24)27-18-17(16-12-13(2)6-7-14(16)3)19(23)22-21(18)10-8-15(25-4)9-11-21/h6-7,12,15,22H,5,8-11H2,1-4H3
54 atoms
O  5.98412 0.086433 0.284929
O  0.02304 1.366813 -0.559482
O  -0.002623 -3.310155 0.18652
O  -1.43842 1.540839 1.078938
O  -1.51287 2.940389 -0.681021
N  1.626515 -1.691617 0.19423
C  1.756991 -0.274124 -0.069843
C  2.371517 0.479389 1.11688
C  2.576579 -0.012861 -1.342207
C  3.846482 0.141931 1.299051
C  4.048509 -0.358191 -1.14485
C  4.636637 0.418463 0.029434
C  0.313612 0.081539 -0.255608
C  -0.503337 -0.968409 -0.155151
C  0.357744 -2.147383 0.100692
C  -1.96117 -1.001389 -0.32178
C  6.897495 0.578194 -0.664054
C  -2.805815 -1.390959 0.727953
C  -2.501674 -0.564553 -1.527777
C  -1.057829 2.01486 -0.07555
C  -3.876981 -0.504251 -1.739199
C  -4.176905 -1.335266 0.508797
C  -2.27185 -1.814772 2.063372
C  -4.707393 -0.902939 -0.699613
C  -4.425178 -0.016449 -3.04681
C  -2.64393 2.07542 1.667739
C  -2.383924 3.357191 2.418737
H  1.811537 0.24763 2.025212
H  2.267448 1.553733 0.941658
H  2.487257 1.043421 -1.610241
H  2.156128 -0.588747 -2.169298
H  4.248737 0.736239 2.122891
H  3.96464 -0.9095 1.582672
H  4.173335 -1.432241 -0.968618
H  4.582355 -0.131438 -2.070526
H  4.560247 1.494996 -0.19906
H  2.417714 -2.315234 0.2475
H  6.791721 1.659621 -0.815513
H  7.902747 0.386812 -0.286901
H  6.809656 0.091426 -1.641302
H  -1.831256 -0.268217 -2.327708
H  -4.850162 -1.62455 1.307423
H  -3.041818 -1.738289 2.830865
H  -1.9309 -2.851161 2.054245
H  -1.426216 -1.202022 2.380233
H  -5.783233 -0.867344 -0.825637
H  -4.071903 0.990884 -3.274426
H  -4.114771 -0.656828 -3.874486
H  -5.514427 0.008634 -3.039691
H  -2.978774 1.29138 2.343939
H  -3.402795 2.19954 0.894266
H  -2.072258 4.169726 1.763465
H  -1.626647 3.218592 3.190749
H  -3.306515 3.665506 2.911953
elementType: O N C H
totalener: -1247.55868457 hartree
nucrepener: 2666.74843381 hartree
electener: -3914.30711838 hartree
oneelecener: -7001.02525714 hartree
twoeener: 3086.71813876 hartree
cpcmener: -0.04166481 hartree
kineticenergy: 1242.09455601 hartree
xcener: -120.049552144632 hartree
chargesum: 0.0000000
charge: -0.376563 -0.308276 -0.504551 -0.252386 -0.415667 -0.226628 0.527662 -0.253117 -0.261185 -0.177314 -0.174100 0.176656 0.101231 0.138374 0.235842 0.032936 -0.115783 -0.208451 -0.198422 0.482541 -0.036332 -0.089046 -0.274551 -0.155281 -0.226575 0.033552 -0.247604 0.097507 0.094288 0.095270 0.101816 0.084606 0.080819 0.080072 0.089385 0.060111 0.168007 0.089294 0.117125 0.090027 0.136578 0.135351 0.102305 0.116647 0.103344 0.139747 0.102473 0.104879 0.090097 0.107882 0.106079 0.091041 0.090495 0.097794
qa: -0.3766 -0.3083 -0.5046 -0.2524 -0.4157 -0.2266 0.5277 -0.2531 -0.2612 -0.1773 -0.1741 0.1767 0.1012 0.1384 0.2358 0.0329 -0.1158 -0.2085 -0.1984 0.4825 -0.0363 -0.0890 -0.2746 -0.1553 -0.2266 0.0336 -0.2476 0.0975 0.0943 0.0953 0.1018 0.0846 0.0808 0.0801 0.0894 0.0601 0.1680 0.0893 0.1171 0.0900 0.1366 0.1354 0.1023 0.1166 0.1033 0.1397 0.1025 0.1049 0.0901 0.1079 0.1061 0.0910 0.0905 0.0978
va: 1.9673 2.1236 2.0265 2.1235 2.0951 3.2329 3.5309 4.0017 4.0273 3.8728 3.7966 3.8840 3.9456 3.1288 4.3855 3.2810 3.9147 3.7983 3.8980 4.4322 3.7944 3.8518 3.9091 3.9105 3.9137 3.8113 3.9506 1.0191 1.0164 1.0159 1.0108 1.0222 1.0264 1.0247 1.0163 1.0068 1.0188 0.9910 0.9916 0.9818 1.0119 1.0004 1.0025 1.0083 0.9973 0.9988 0.9957 0.9948 1.0051 0.9911 1.0033 1.0125 1.0031 1.0063
dispcorr: -0.031514422 hartree
energy: -1247.590198988988
dipole: 7.65045 -7.08065 0.56980 7.64430 -5.86853 1.77577 3.42823 -2.91782 0.51041
magnitude: 1.93354 au
magnitude: 4.91466 debye
