program: Orca
programVersion: 5.0.2
elementType: O O O O O N C C C C C C C C C C C C C C C C C C C C C H H H H H H H H H H H H H H H H H H H H H H H H H H H
charge: 0
multiplicity: 1
keywords: wb97x-d3
keywords: def2-TZVPP
keywords: def2/J RIJCOSX
keywords: DEFGRID2
keywords: scfconv7
keywords: smallprint printgap noloewdin
keywords: NOSOSCF
formula: C21H27NO5
InChI: InChI=1/C21H27NO5/c1-5-26-20(24)27-18-17(16-12-13(2)6-7-14(16)3)19(23)22-21(18)10-8-15(25-4)9-11-21/h6-7,12,15,22H,5,8-11H2,1-4H3
54 atoms
O  5.770411 0.337299 -0.086036
O  -0.345782 1.001078 0.813091
O  0.031525 -3.296398 -1.135038
O  -1.277572 2.917678 0.931163
O  -0.909036 2.039592 -1.109383
N  1.547803 -1.653804 -0.598157
C  1.565946 -0.327406 -0.028179
C  2.32001 -0.297125 1.311032
C  2.17616 0.702228 -0.990023
C  3.819112 -0.504166 1.122835
C  3.675268 0.490339 -1.168793
C  4.40387 0.533085 0.16573
C  0.090675 -0.122502 0.17736
C  -0.642436 -1.168451 -0.189157
C  0.303623 -2.200354 -0.709585
C  -2.096475 -1.35734 -0.107866
C  6.621126 0.689426 0.966837
C  -2.640189 -2.256299 0.814301
C  -2.928192 -0.634045 -0.957049
C  -0.86041 2.002982 0.084541
C  -4.309514 -0.772968 -0.917057
C  -4.023478 -2.387097 0.853666
C  -1.770001 -3.057339 1.735769
C  -4.845096 -1.661497 0.007845
C  -5.193629 -0.006824 -1.856883
C  -1.868752 4.099036 0.376932
C  -0.831878 5.094017 -0.093606
H  1.909363 -1.062644 1.972772
H  2.145407 0.667916 1.796027
H  2.006901 1.706982 -0.591491
H  1.65883 0.653816 -1.94878
H  4.306286 -0.452634 2.099569
H  4.024385 -1.507422 0.734153
H  3.873615 -0.468182 -1.660441
H  4.077951 1.258879 -1.831516
H  4.24475 1.532869 0.609984
H  2.370223 -2.148991 -0.895896
H  6.531586 0.028763 1.837125
H  7.644706 0.620625 0.600333
H  6.449988 1.718651 1.309055
H  -2.480291 0.043407 -1.673139
H  -4.467582 -3.071802 1.566264
H  -1.005184 -2.43984 2.209289
H  -2.357737 -3.518669 2.528289
H  -1.257055 -3.853266 1.194477
H  -5.91952 -1.790539 0.069551
H  -4.654975 0.808063 -2.339022
H  -5.582101 -0.652222 -2.647004
H  -6.052678 0.422149 -1.339825
H  -2.456463 4.51196 1.195077
H  -2.552476 3.831846 -0.430298
H  -1.33059 6.009654 -0.412263
H  -0.263634 4.715995 -0.941681
H  -0.140371 5.354709 0.70716
totalener: -1247.52946267 hartree
nucrepener: 2622.37197412 hartree
electener: -3869.90143679 hartree
oneelecener: -6912.32452409 hartree
twoeener: 3042.42308730 hartree
kineticenergy: 1242.15587371 hartree
xcener: -120.049135261873 hartree
chargesum: 0.0000000
charge: -0.312988 -0.295101 -0.363016 -0.263679 -0.376477 -0.236460 0.501358 -0.267343 -0.261546 -0.202044 -0.195341 0.196820 0.125274 0.047738 0.217310 0.100040 -0.117962 -0.136476 -0.225344 0.473140 -0.010942 -0.065386 -0.255375 -0.138415 -0.233430 0.033622 -0.258335 0.096340 0.091304 0.078225 0.110232 0.078620 0.085230 0.078387 0.083494 0.039784 0.138512 0.078101 0.112691 0.076421 0.135796 0.103094 0.087363 0.081049 0.121110 0.106006 0.081227 0.102076 0.087675 0.102875 0.092037 0.086432 0.099359 0.086922
qa: -0.3130 -0.2951 -0.3630 -0.2637 -0.3765 -0.2365 0.5014 -0.2673 -0.2615 -0.2020 -0.1953 0.1968 0.1253 0.0477 0.2173 0.1000 -0.1180 -0.1365 -0.2253 0.4731 -0.0109 -0.0654 -0.2554 -0.1384 -0.2334 0.0336 -0.2583 0.0963 0.0913 0.0782 0.1102 0.0786 0.0852 0.0784 0.0835 0.0398 0.1385 0.0781 0.1127 0.0764 0.1358 0.1031 0.0874 0.0810 0.1211 0.1060 0.0812 0.1021 0.0877 0.1029 0.0920 0.0864 0.0994 0.0869
va: 2.0293 2.1256 2.1744 2.1551 2.1019 3.2042 3.6193 4.0026 3.9752 3.7925 3.8874 3.8428 3.8626 3.3417 4.3946 3.3755 3.9481 3.9431 3.9457 4.3915 3.8228 3.9040 3.9148 4.0037 3.9235 3.8844 3.9138 1.0178 1.0179 1.0154 1.0240 1.0210 1.0251 1.0286 1.0273 1.0090 1.0419 0.9816 0.9952 0.9911 1.0190 1.0090 0.9963 1.0091 1.0031 1.0053 1.0080 0.9926 0.9989 0.9952 1.0070 1.0106 1.0114 1.0044
dispcorr: -0.029114558 hartree
energy: -1247.558577227048
dipole: 10.09615 -9.63012 0.46604 12.14966 -10.11931 2.03034 3.93995 -2.84147 1.09848
magnitude: 2.35503 au
magnitude: 5.98600 debye
