program: Orca
programVersion: 5.0.2
elementType: O O O O O N C C C C C C C C C C C C C C C C C C C C C H H H H H H H H H H H H H H H H H H H H H H H H H H H
charge: 0
multiplicity: 1
keywords: wb97x-d3
keywords: def2-TZVPP
keywords: def2/J RIJCOSX
keywords: DEFGRID2
keywords: scfconv7
keywords: smallprint printgap noloewdin
keywords: NOSOSCF
formula: C21H27NO5
InChI: InChI=1/C21H27NO5/c1-5-26-20(24)27-18-17(16-12-13(2)6-7-14(16)3)19(23)22-21(18)10-8-15(25-4)9-11-21/h6-7,12,15,22H,5,8-11H2,1-4H3
54 atoms
O  5.951905 0.18037 -0.238512
O  -0.076666 1.010896 0.84745
O  0.029533 -3.088069 -1.522314
O  -1.294962 2.7413 1.153633
O  -1.175434 1.884611 -0.924593
N  1.642892 -1.649337 -0.739798
C  1.733716 -0.372163 -0.072905
C  2.53161 -0.461078 1.236142
C  2.341191 0.7097 -0.979542
C  4.016752 -0.696265 0.979737
C  3.827373 0.475269 -1.225313
C  4.601755 0.393327 0.081954
C  0.276438 -0.116528 0.178277
C  -0.518197 -1.08061 -0.276853
C  0.364867 -2.088291 -0.936564
C  -1.978784 -1.179954 -0.220065
C  6.849501 0.378006 0.815723
C  -2.668147 -1.18303 0.999875
C  -2.680483 -1.269955 -1.41772
C  -0.899276 1.888405 0.234019
C  -4.066917 -1.328902 -1.452902
C  -4.056311 -1.251385 0.957777
C  -1.967549 -1.134528 2.327502
C  -4.746252 -1.315268 -0.241336
C  -4.795164 -1.399145 -2.763194
C  -2.181549 3.780608 0.720229
C  -2.532347 4.612497 1.928966
H  2.119562 -1.260712 1.854799
H  2.402094 0.471509 1.793136
H  2.207642 1.685878 -0.503638
H  1.792273 0.741064 -1.922176
H  4.536284 -0.730867 1.940324
H  4.177342 -1.6736 0.511984
H  3.983639 -0.446957 -1.795047
H  4.230167 1.282948 -1.83964
H  4.490184 1.359342 0.607812
H  2.430537 -2.132877 -1.134714
H  6.773456 -0.38489 1.59937
H  7.856645 0.331677 0.40293
H  6.720515 1.359715 1.290503
H  -2.125333 -1.278772 -2.347552
H  -4.610775 -1.265064 1.888757
H  -2.593968 -1.567439 3.10685
H  -1.028849 -1.687935 2.315145
H  -1.736058 -0.11232 2.632043
H  -5.828581 -1.366761 -0.231437
H  -4.459342 -2.248384 -3.359466
H  -5.870175 -1.501707 -2.619656
H  -4.627169 -0.500275 -3.358502
H  -3.073112 3.33713 0.272759
H  -1.691787 4.385268 -0.046071
H  -1.647965 5.066477 2.374662
H  -3.035688 4.018682 2.690985
H  -3.206443 5.415277 1.631732
totalener: -1247.52949276 hartree
nucrepener: 2625.07970066 hartree
electener: -3872.60919342 hartree
oneelecener: -6917.84468601 hartree
twoeener: 3045.23549259 hartree
kineticenergy: 1242.15174246 hartree
xcener: -120.047293756176 hartree
chargesum: 0.0000000
charge: -0.311905 -0.327471 -0.358720 -0.267118 -0.337356 -0.241811 0.527680 -0.264333 -0.265750 -0.198939 -0.192692 0.189618 0.051183 0.158702 0.186064 0.031690 -0.119102 -0.134556 -0.108705 0.471467 -0.058873 -0.085920 -0.243020 -0.110516 -0.233823 0.023080 -0.228993 0.092747 0.090942 0.080709 0.109022 0.079495 0.084852 0.077257 0.083567 0.041923 0.137481 0.079213 0.112592 0.076350 0.093614 0.101167 0.090394 0.095593 0.097027 0.104210 0.103095 0.074472 0.099630 0.097847 0.093678 0.084583 0.088197 0.080466
qa: -0.3119 -0.3275 -0.3587 -0.2671 -0.3374 -0.2418 0.5277 -0.2643 -0.2657 -0.1989 -0.1927 0.1896 0.0512 0.1587 0.1861 0.0317 -0.1191 -0.1346 -0.1087 0.4715 -0.0589 -0.0859 -0.2430 -0.1105 -0.2338 0.0231 -0.2290 0.0927 0.0909 0.0807 0.1090 0.0795 0.0849 0.0773 0.0836 0.0419 0.1375 0.0792 0.1126 0.0763 0.0936 0.1012 0.0904 0.0956 0.0970 0.1042 0.1031 0.0745 0.0996 0.0978 0.0937 0.0846 0.0882 0.0805
va: 2.0304 2.0953 2.1822 2.1427 2.1613 3.2132 3.4991 3.9978 3.9751 3.7893 3.8864 3.8508 3.9413 3.2146 4.4122 3.3916 3.9481 3.8228 3.9840 4.3966 3.8719 3.9366 3.9321 3.9579 3.9235 3.8764 3.9610 1.0205 1.0182 1.0166 1.0221 1.0198 1.0242 1.0293 1.0275 1.0086 1.0423 0.9813 0.9954 0.9910 1.0266 1.0094 1.0072 1.0019 1.0016 1.0076 0.9959 1.0076 0.9943 0.9962 0.9970 1.0052 1.0049 1.0083
dispcorr: -0.029121628 hartree
energy: -1247.558614388809
dipole: 7.22425 -6.81415 0.41010 10.61249 -8.70834 1.90415 7.46618 -6.15764 1.30854
magnitude: 2.34654 au
magnitude: 5.96444 debye
