program: Orca
programVersion: 5.0.2
elementType: O O O O O N C C C C C C C C C C C C C C C C C C C C C H H H H H H H H H H H H H H H H H H H H H H H H H H H
charge: 0
multiplicity: 1
keywords: wb97x-d3
keywords: def2-TZVPP
keywords: def2/J RIJCOSX
keywords: DEFGRID2
keywords: scfconv7
keywords: smallprint printgap noloewdin
keywords: NOSOSCF
formula: C21H27NO5
InChI: InChI=1/C21H27NO5/c1-5-26-20(24)27-18-17(16-12-13(2)6-7-14(16)3)19(23)22-21(18)10-8-15(25-4)9-11-21/h6-7,12,15,22H,5,8-11H2,1-4H3
54 atoms
O  5.977452 0.126646 -0.231333
O  -0.055562 1.132938 0.807277
O  0.01623 -3.231432 -1.009416
O  -1.293547 2.869268 0.960533
O  -0.876223 2.036386 -1.089973
N  1.642969 -1.66554 -0.566665
C  1.752903 -0.333253 -0.019543
C  2.549657 -0.318559 1.293436
C  2.376711 0.650073 -1.020779
C  4.031671 -0.596581 1.060982
C  3.856941 0.365457 -1.244227
C  4.631879 0.394352 0.064342
C  0.299058 -0.035167 0.208137
C  -0.505406 -1.029565 -0.149455
C  0.364267 -2.137152 -0.639981
C  -1.972103 -1.102001 -0.069693
C  6.882605 0.450709 0.783985
C  -2.587654 -1.71846 1.022773
C  -2.740842 -0.54955 -1.087724
C  -0.775849 2.023925 0.099554
C  -4.129775 -0.571685 -1.047294
C  -3.976808 -1.737361 1.060592
C  -1.775638 -2.342634 2.118252
C  -4.736387 -1.171696 0.04948
C  -4.945354 0.014481 -2.163391
C  -2.227796 3.827027 0.445373
C  -3.595387 3.211944 0.24221
H  2.126236 -1.053312 1.981463
H  2.435143 0.6612 1.766401
H  2.261186 1.668194 -0.637201
H  1.826506 0.60372 -1.961537
H  4.551693 -0.547906 2.020751
H  4.181902 -1.615349 0.68733
H  3.991685 -0.609349 -1.72482
H  4.273332 1.103766 -1.932343
H  4.53773 1.407803 0.495642
H  2.431799 -2.244422 -0.796458
H  6.786341 1.496283 1.105186
H  6.782786 -0.182636 1.673381
H  7.887125 0.309861 0.386515
H  -2.239183 -0.089175 -1.929378
H  -4.475689 -2.203172 1.90194
H  -1.092525 -1.624511 2.575127
H  -2.415308 -2.737382 2.906678
H  -1.173508 -3.169129 1.7373
H  -5.817713 -1.201678 0.117031
H  -5.273541 -0.759346 -2.86004
H  -5.840538 0.511299 -1.78864
H  -4.375126 0.744691 -2.736978
H  -1.848623 4.266055 -0.478805
H  -2.259894 4.607251 1.203991
H  -3.967255 2.763063 1.162595
H  -3.585622 2.44593 -0.531937
H  -4.299085 3.986813 -0.063207
totalener: -1247.52863248 hartree
nucrepener: 2645.63963650 hartree
electener: -3893.16826898 hartree
oneelecener: -6958.88656138 hartree
twoeener: 3065.71829240 hartree
kineticenergy: 1242.16243473 hartree
xcener: -120.050002782334 hartree
chargesum: -0.0000000
charge: -0.312606 -0.311606 -0.359048 -0.261767 -0.361573 -0.236997 0.503248 -0.265615 -0.264665 -0.203357 -0.192909 0.194357 0.102535 0.101699 0.204695 0.087703 -0.118060 -0.131773 -0.219566 0.473838 -0.047882 -0.070027 -0.246351 -0.116873 -0.236996 0.029483 -0.237986 0.094905 0.091214 0.082384 0.107338 0.078886 0.083452 0.079450 0.083360 0.041055 0.136993 0.076812 0.077563 0.112558 0.116239 0.103113 0.092692 0.079977 0.110981 0.106953 0.112223 0.088042 0.086102 0.092342 0.099966 0.092596 0.084481 0.086423
qa: -0.3126 -0.3116 -0.3590 -0.2618 -0.3616 -0.2370 0.5032 -0.2656 -0.2647 -0.2034 -0.1929 0.1944 0.1025 0.1017 0.2047 0.0877 -0.1181 -0.1318 -0.2196 0.4738 -0.0479 -0.0700 -0.2464 -0.1169 -0.2370 0.0295 -0.2380 0.0949 0.0912 0.0824 0.1073 0.0789 0.0835 0.0795 0.0834 0.0411 0.1370 0.0768 0.0776 0.1126 0.1162 0.1031 0.0927 0.0800 0.1110 0.1070 0.1122 0.0880 0.0861 0.0923 0.1000 0.0926 0.0845 0.0864
va: 2.0295 2.1081 2.1791 2.1573 2.1241 3.2034 3.5728 4.0067 3.9699 3.7970 3.8842 3.8460 3.9070 3.2545 4.4114 3.2955 3.9484 3.9430 3.9332 4.4044 3.7953 3.9105 3.9325 3.9755 3.9107 3.8926 3.9114 1.0175 1.0172 1.0180 1.0249 1.0210 1.0248 1.0286 1.0272 1.0085 1.0422 0.9911 0.9815 0.9952 1.0299 1.0094 0.9942 1.0107 1.0003 1.0044 0.9937 0.9997 1.0038 1.0076 0.9958 1.0061 1.0124 1.0111
dispcorr: -0.030795958 hartree
energy: -1247.559428440999
dipole: 5.00430 -4.74793 0.25637 8.06412 -6.25450 1.80962 4.04025 -2.93041 1.10984
magnitude: 2.13827 au
magnitude: 5.43505 debye
