program: Orca
programVersion: 5.0.2
elementType: O O O O O N C C C C C C C C C C C C C C C C C C C C C H H H H H H H H H H H H H H H H H H H H H H H H H H H
charge: 0
multiplicity: 1
keywords: wb97x-d3
keywords: def2-TZVPP
keywords: def2/J RIJCOSX
keywords: DEFGRID2
keywords: scfconv7
keywords: smallprint printgap noloewdin
keywords: NOSOSCF
formula: C21H27NO5
InChI: InChI=1/C21H27NO5/c1-5-26-20(24)27-18-17(16-12-13(2)6-7-14(16)3)19(23)22-21(18)10-8-15(25-4)9-11-21/h6-7,12,15,22H,5,8-11H2,1-4H3
54 atoms
O  5.948066 -0.017813 0.221688
O  -0.146841 1.065096 0.848895
O  0.029701 -3.273357 -1.019307
O  -1.239242 2.9004 0.924755
O  -0.69747 2.066839 -1.095714
N  1.625687 -1.69114 -0.52927
C  1.710857 -0.376014 0.063074
C  2.442358 -0.406063 1.414408
C  2.389997 0.632779 -0.873956
C  3.931403 -0.686144 1.248984
C  3.878493 0.339936 -1.035295
C  4.588682 0.320897 0.316923
C  0.247085 -0.087613 0.240756
C  -0.538204 -1.086844 -0.14528
C  0.354864 -2.179122 -0.628761
C  -2.004669 -1.166512 -0.091833
C  6.768254 0.978316 -0.317853
C  -2.634568 -1.914347 0.905844
C  -2.760924 -0.475153 -1.033034
C  -0.713313 2.025369 0.098411
C  -4.149255 -0.487631 -1.005094
C  -4.024763 -1.924898 0.929117
C  -1.841067 -2.682552 1.920149
C  -4.770848 -1.223179 -0.002564
C  -4.954336 0.272867 -2.018277
C  -1.985148 3.976541 0.342167
C  -3.37569 3.542068 -0.066782
H  1.981101 -1.158944 2.057178
H  2.30733 0.559326 1.910799
H  2.266591 1.639309 -0.463115
H  1.886241 0.624669 -1.840984
H  4.421213 -0.656815 2.224403
H  4.094047 -1.696881 0.859384
H  4.029275 -0.622887 -1.535121
H  4.314024 1.095237 -1.693839
H  4.484599 1.324581 0.76844
H  2.424786 -2.27248 -0.713716
H  6.65366 1.936381 0.206398
H  7.801291 0.651775 -0.203297
H  6.589272 1.156986 -1.384419
H  -2.247836 0.081075 -1.807225
H  -4.534416 -2.494603 1.696902
H  -1.11117 -2.048222 2.426068
H  -2.488496 -3.113024 2.683207
H  -1.292998 -3.500909 1.450995
H  -5.853104 -1.253138 0.05047
H  -5.626439 -0.385793 -2.57011
H  -5.571651 1.038016 -1.543909
H  -4.314028 0.770452 -2.745768
H  -1.439254 4.3999 -0.502608
H  -2.029891 4.728301 1.128488
H  -3.918743 3.111091 0.773521
H  -3.351521 2.8111 -0.873727
H  -3.934719 4.40934 -0.419121
totalener: -1247.52906430 hartree
nucrepener: 2640.91701433 hartree
electener: -3888.44607863 hartree
oneelecener: -6949.39681184 hartree
twoeener: 3060.95073320 hartree
kineticenergy: 1242.15677968 hartree
xcener: -120.048975827435 hartree
chargesum: 0.0000000
charge: -0.312959 -0.302501 -0.360969 -0.261435 -0.368830 -0.240016 0.505882 -0.251013 -0.277947 -0.199004 -0.197002 0.193071 0.114530 0.057781 0.215423 0.102728 -0.117446 -0.137360 -0.236334 0.474269 -0.008886 -0.059776 -0.246205 -0.143598 -0.257539 0.031462 -0.248737 0.095658 0.088693 0.083847 0.108426 0.082664 0.077946 0.084785 0.080139 0.040949 0.137496 0.076053 0.112485 0.078562 0.132467 0.103759 0.090386 0.079589 0.114606 0.108326 0.109420 0.095033 0.087835 0.091659 0.100763 0.094667 0.087595 0.088602
qa: -0.3130 -0.3025 -0.3610 -0.2614 -0.3688 -0.2400 0.5059 -0.2510 -0.2779 -0.1990 -0.1970 0.1931 0.1145 0.0578 0.2154 0.1027 -0.1174 -0.1374 -0.2363 0.4743 -0.0089 -0.0598 -0.2462 -0.1436 -0.2575 0.0315 -0.2487 0.0957 0.0887 0.0838 0.1084 0.0827 0.0779 0.0848 0.0801 0.0409 0.1375 0.0761 0.1125 0.0786 0.1325 0.1038 0.0904 0.0796 0.1146 0.1083 0.1094 0.0950 0.0878 0.0917 0.1008 0.0947 0.0876 0.0886
va: 2.0293 2.1202 2.1759 2.1570 2.1141 3.2060 3.5893 3.9705 4.0068 3.8933 3.7931 3.8495 3.8758 3.3211 4.4031 3.3414 3.9478 3.9524 3.9361 4.3974 3.7844 3.8916 3.9223 4.0053 3.9160 3.8939 3.9094 1.0182 1.0180 1.0165 1.0245 1.0277 1.0285 1.0249 1.0193 1.0088 1.0425 0.9912 0.9951 0.9817 1.0210 1.0091 0.9951 1.0103 1.0038 1.0046 0.9988 0.9910 1.0057 1.0071 0.9955 1.0043 1.0124 1.0103
dispcorr: -0.030534081 hartree
energy: -1247.559598377761
dipole: 5.17571 -4.92965 0.24606 10.47165 -8.38743 2.08422 0.36385 0.25248 0.61633
magnitude: 2.18732 au
magnitude: 5.55973 debye
