program: Orca
programVersion: 5.0.2
elementType: O O O O O N C C C C C C C C C C C C C C C C C C C C C H H H H H H H H H H H H H H H H H H H H H H H H H H H
charge: 0
multiplicity: 1
keywords: wb97x-d3
keywords: def2-TZVPP
keywords: def2/J RIJCOSX
keywords: DEFGRID2
keywords: scfconv7
keywords: smallprint printgap noloewdin
keywords: NOSOSCF
formula: C21H27NO5
InChI: InChI=1/C21H27NO5/c1-5-26-20(24)27-18-17(16-12-13(2)6-7-14(16)3)19(23)22-21(18)10-8-15(25-4)9-11-21/h6-7,12,15,22H,5,8-11H2,1-4H3
54 atoms
O  5.925543 0.017148 0.12625
O  -0.135533 0.910014 1.032918
O  0.024827 -3.048241 -1.561673
O  -1.458088 2.535738 1.455877
O  -1.213772 1.893348 -0.690903
N  1.61759 -1.631492 -0.702452
C  1.695523 -0.409188 0.061308
C  2.471964 -0.598273 1.372749
C  2.320431 0.735854 -0.750123
C  3.958436 -0.822517 1.121339
C  3.807414 0.503732 -1.000323
C  4.566406 0.314129 0.312679
C  0.233756 -0.171559 0.301867
C  -0.55095 -1.10546 -0.229083
C  0.34594 -2.073264 -0.927881
C  -2.012179 -1.205355 -0.209927
C  6.711243 1.084499 -0.319749
C  -2.73361 -1.242032 0.987838
C  -2.683697 -1.256296 -1.4312
C  -0.982177 1.801799 0.474123
C  -4.065936 -1.308555 -1.506056
C  -4.123412 -1.297055 0.905115
C  -2.07618 -1.243302 2.338538
C  -4.779753 -1.321253 -0.310791
C  -4.775004 -1.373365 -2.827238
C  -2.379866 3.574851 1.10301
C  -1.678811 4.817234 0.601577
H  2.046343 -1.439327 1.923698
H  2.336732 0.290682 1.995596
H  2.192424 1.671732 -0.197712
H  1.782189 0.848471 -1.692592
H  4.483238 -0.915021 2.07421
H  4.119505 -1.767898 0.592424
H  3.959806 -0.376085 -1.634704
H  4.205377 1.353202 -1.560547
H  4.46302 1.245639 0.898931
H  2.417733 -2.125493 -1.056795
H  6.485741 1.389411 -1.348234
H  6.609473 1.969625 0.322104
H  7.751481 0.762342 -0.289049
H  -2.103793 -1.240053 -2.345205
H  -4.702273 -1.330089 1.820681
H  -2.7067 -1.749955 3.068738
H  -1.113945 -1.754069 2.325753
H  -1.902074 -0.232721 2.711935
H  -5.862731 -1.362481 -0.331356
H  -5.17419 -2.3726 -3.010885
H  -5.614319 -0.67802 -2.866456
H  -4.107211 -1.133238 -3.653231
H  -2.916098 3.780568 2.027878
H  -3.097427 3.202903 0.370422
H  -1.169689 4.640932 -0.34418
H  -0.955712 5.18551 1.328671
H  -2.415353 5.604464 0.438389
totalener: -1247.52887411 hartree
nucrepener: 2635.20815493 hartree
electener: -3882.73702904 hartree
oneelecener: -6938.12186502 hartree
twoeener: 3055.38483598 hartree
kineticenergy: 1242.15530187 hartree
xcener: -120.049419084482 hartree
chargesum: -0.0000000
charge: -0.312350 -0.328243 -0.359842 -0.269773 -0.343040 -0.241897 0.529949 -0.244856 -0.279703 -0.198847 -0.198944 0.191869 0.054588 0.155403 0.184272 0.023933 -0.118843 -0.127447 -0.099829 0.470118 -0.049366 -0.085837 -0.242312 -0.127383 -0.227143 0.030323 -0.253751 0.092661 0.087766 0.083047 0.108135 0.083085 0.078675 0.084748 0.080109 0.041508 0.137250 0.078872 0.076423 0.112482 0.091598 0.101888 0.091902 0.095584 0.097020 0.108069 0.100876 0.086967 0.082376 0.099876 0.096555 0.100266 0.085479 0.085733
qa: -0.3124 -0.3282 -0.3598 -0.2698 -0.3430 -0.2419 0.5299 -0.2449 -0.2797 -0.1988 -0.1989 0.1919 0.0546 0.1554 0.1843 0.0239 -0.1188 -0.1274 -0.0998 0.4701 -0.0494 -0.0858 -0.2423 -0.1274 -0.2271 0.0303 -0.2538 0.0927 0.0878 0.0830 0.1081 0.0831 0.0787 0.0847 0.0801 0.0415 0.1372 0.0789 0.0764 0.1125 0.0916 0.1019 0.0919 0.0956 0.0970 0.1081 0.1009 0.0870 0.0824 0.0999 0.0966 0.1003 0.0855 0.0857
va: 2.0301 2.0970 2.1811 2.1455 2.1509 3.2166 3.4912 3.9611 4.0085 3.8922 3.7909 3.8519 3.9317 3.2332 4.4129 3.4133 3.9483 3.8044 3.9966 4.3994 3.8572 3.9295 3.9301 3.9696 3.9186 3.8838 3.9157 1.0211 1.0191 1.0160 1.0220 1.0274 1.0284 1.0250 1.0198 1.0084 1.0424 0.9814 0.9911 0.9953 1.0274 1.0089 1.0063 1.0035 1.0031 1.0046 0.9923 0.9986 1.0091 0.9956 1.0062 1.0117 1.0047 1.0101
dispcorr: -0.029557277 hartree
energy: -1247.558431382341
dipole: 8.42911 -8.09546 0.33364 12.90065 -10.78274 2.11791 1.58494 -0.71855 0.86639
magnitude: 2.31246 au
magnitude: 5.87781 debye
