program: Orca
programVersion: 5.0.2
elementType: O O O O O N C C C C C C C C C C C C C C C C C C C C C H H H H H H H H H H H H H H H H H H H H H H H H H H H
charge: 0
multiplicity: 1
keywords: wb97x-d3
keywords: def2-TZVPP
keywords: def2/J RIJCOSX
keywords: DEFGRID2
keywords: scfconv7
keywords: smallprint printgap noloewdin
keywords: NOSOSCF
formula: C21H27NO5
InChI: InChI=1/C21H27NO5/c1-5-26-20(24)27-18-17(16-12-13(2)6-7-14(16)3)19(23)22-21(18)10-8-15(25-4)9-11-21/h6-7,12,15,22H,5,8-11H2,1-4H3
54 atoms
O  5.257405 0.332722 -0.210493
O  0.413822 1.040198 -0.681665
O  -0.308496 -3.510945 0.411261
O  -1.01746 1.627314 0.888325
O  -1.016814 2.675831 -1.102093
N  1.542822 -2.154694 0.318554
C  1.896945 -0.800982 -0.039242
C  2.616432 -0.105861 1.132264
C  2.781728 -0.78775 -1.299261
C  3.219266 1.249456 0.777968
C  3.385241 0.575683 -1.623952
C  4.138856 1.161754 -0.438957
C  0.515381 -0.244217 -0.272733
C  -0.453749 -1.146116 -0.095099
C  0.210322 -2.432256 0.246708
C  -1.899727 -0.958239 -0.256174
C  6.213132 0.856053 0.663927
C  -2.789827 -1.21459 0.797019
C  -2.378146 -0.44775 -1.45835
C  -0.622379 1.847067 -0.345783
C  -3.726092 -0.166191 -1.658896
C  -4.134956 -0.943065 0.587664
C  -2.321524 -1.739375 2.121068
C  -4.600143 -0.42658 -0.613753
C  -4.195777 0.400865 -2.965636
C  -2.221735 2.294671 1.299925
C  -2.44786 1.986589 2.758249
H  3.418544 -0.773095 1.459305
H  1.927403 -0.017465 1.975134
H  2.208111 -1.168874 -2.147057
H  3.597202 -1.496623 -1.132432
H  2.44109 1.985065 0.567758
H  3.75765 1.639105 1.645798
H  4.066912 0.472942 -2.470992
H  2.612432 1.280492 -1.933768
H  4.479585 2.176645 -0.698747
H  2.228373 -2.886489 0.399101
H  5.868139 0.910308 1.703298
H  7.081587 0.198617 0.636232
H  6.53821 1.861849 0.367344
H  -1.679069 -0.269911 -2.268325
H  -4.839133 -1.130312 1.38981
H  -3.078332 -1.586613 2.890567
H  -2.109072 -2.80655 2.068322
H  -1.406262 -1.244262 2.449288
H  -5.657615 -0.22266 -0.732879
H  -4.042145 -0.305123 -3.783322
H  -5.257067 0.644716 -2.938795
H  -3.651306 1.312053 -3.21705
H  -3.04966 1.930966 0.687353
H  -2.119295 3.368574 1.134077
H  -1.624165 2.339975 3.37806
H  -2.577099 0.918954 2.926138
H  -3.355404 2.488979 3.091943
totalener: -1247.52629741 hartree
nucrepener: 2727.67932948 hartree
electener: -3975.20562689 hartree
oneelecener: -7122.86288844 hartree
twoeener: 3147.65726155 hartree
kineticenergy: 1242.15343970 hartree
xcener: -120.053923637160 hartree
chargesum: 0.0000000
charge: -0.339527 -0.303399 -0.373544 -0.249880 -0.311815 -0.215468 0.471026 -0.206769 -0.210613 -0.224342 -0.201905 0.185330 0.036971 0.056616 0.220029 0.077455 -0.119331 -0.168047 -0.164424 0.399147 -0.027499 -0.077659 -0.292347 -0.118704 -0.231952 0.001555 -0.243315 0.089268 0.091831 0.096100 0.091195 0.092431 0.085483 0.083232 0.092779 0.078583 0.129632 0.075171 0.112653 0.078749 0.124191 0.103546 0.083910 0.143172 0.092082 0.106000 0.101405 0.075573 0.104983 0.113401 0.116312 0.088881 0.095919 0.085928
qa: -0.3395 -0.3034 -0.3735 -0.2499 -0.3118 -0.2155 0.4710 -0.2068 -0.2106 -0.2243 -0.2019 0.1853 0.0370 0.0566 0.2200 0.0775 -0.1193 -0.1680 -0.1644 0.3991 -0.0275 -0.0777 -0.2923 -0.1187 -0.2320 0.0016 -0.2433 0.0893 0.0918 0.0961 0.0912 0.0924 0.0855 0.0832 0.0928 0.0786 0.1296 0.0752 0.1127 0.0787 0.1242 0.1035 0.0839 0.1432 0.0921 0.1060 0.1014 0.0756 0.1050 0.1134 0.1163 0.0889 0.0959 0.0859
va: 2.0116 2.1173 2.1611 2.1060 2.1944 3.1706 3.6041 3.9598 3.9776 3.8948 3.9386 3.8860 3.9977 3.2150 4.3840 3.3127 3.9543 3.8408 3.8866 4.4892 3.8288 3.8834 3.9033 3.9429 3.9221 3.8266 3.9440 1.0192 1.0238 1.0128 1.0232 1.0278 1.0099 1.0256 1.0219 1.0014 1.0459 0.9808 0.9944 0.9931 1.0147 1.0095 1.0005 1.0089 0.9929 1.0080 0.9953 1.0081 0.9973 0.9911 1.0062 1.0071 0.9988 1.0099
dispcorr: -0.033734941 hartree
energy: -1247.560032354099
dipole: 5.55910 -4.93608 0.62301 8.93394 -7.64826 1.28568 7.47742 -6.64017 0.83725
magnitude: 1.65593 au
magnitude: 4.20905 debye
